Wine Test Bot
    

Job 57656 - WineTest: debian10 VM

Step no Task no Status VM Timeout File name Arguments / Missions Execution started Time Number of test failures
1 1 completed debian10 1800 32 bit WineTest 28m 16s 367
1 2 completed debian10 1800 32 bit French WineTest 26m 4s 370
1 3 completed debian10 1800 32 bit Japanese:Japan WineTest 30m 4s 379
1 4 completed debian10 1800 32 bit Chinese:China WineTest 29m 41s 371
1 5 completed debian10 1800 32 bit WoW WineTest 26m 21s 377
1 6 completed debian10 1800 64 bit WoW WineTest 26m 26s 377

debian10 (32 bit tests)

Debian 10 / vm4Debian 10 configured for Wine. Runs fvwm with 2 screens. [CPU:4*host RAM:3GB disk:virtio-scsi eth:virtio snd:ich9 GPU:qxl display:spice testagentd:1.7]
Missions: win32,test=module
32 bit report
d3d10core
d3d10core.c:4773: Test failed: Got unexpected CPrimitives count: 3.
d3d10core.c:4970: Test succeeded inside todo block: Got unexpected PrimitivesStorageNeeded: 0.
d3d10core.c:4980: Test succeeded inside todo block: Got unexpected PrimitivesStorageNeeded: 0.
d3d10core.c:4787: Test failed: Got unexpected CPrimitives count: 3.
d3d10core.c:7479: Test failed: Test 52: Got unexpected color 0xff0000ff at (0, 0).
d3d10core.c:7479: Test failed: Test 52: Got unexpected color 0xff00ffff at (1, 0).
d3d10core.c:7479: Test failed: Test 52: Got unexpected color 0xff00ff00 at (2, 0).
d3d10core.c:7479: Test failed: Test 52: Got unexpected color 0xffffff00 at (3, 0).
d3d10core.c:7479: Test failed: Test 52: Got unexpected color 0xffff0000 at (0, 1).
d3d10core.c:7479: Test failed: Test 52: Got unexpected color 0xffff00ff at (1, 1).
d3d10core.c:7479: Test failed: Test 52: Got unexpected color 0xff000000 at (2, 1).
d3d10core.c:7479: Test failed: Test 52: Got unexpected color 0xff7f7f7f at (3, 1).
d3d10core.c:7479: Test failed: Test 52: Got unexpected color 0xffffffff at (0, 2).
d3d10core.c:7479: Test failed: Test 52: Got unexpected color 0xffffffff at (1, 2).
d3d10core.c:7479: Test failed: Test 52: Got unexpected color 0xffffffff at (2, 2).
d3d10core.c:7479: Test failed: Test 52: Got unexpected color 0xff000000 at (3, 2).
d3d10core.c:7479: Test failed: Test 52: Got unexpected color 0xffffffff at (0, 3).
d3d10core.c:7479: Test failed: Test 52: Got unexpected color 0xff000000 at (2, 3).
d3d10core.c:7479: Test failed: Test 52: Got unexpected color 0xff000000 at (3, 3).
d3d10core.c:12598: Test failed: Got {-1.00003052e+000, 0.00000000e+000, 1.00000000e+000, 0.00000000e+000}, expected {-1.00000000e+000, 0.00000000e+000, 1.00000000e+000, 0.00000000e+000} at (0, 0), sub-resource 0.
d3d10core.c:12958: Test failed: Got {0x00000000, 0x00000000, 0x00000000, 0x00000000}, expected {0x00000000, 0xffffffff, 0x00000000, 0x00000000} at (0, 0), sub-resource 0.
d3d10core.c:12958: Test failed: Got {0x00000000, 0x00000000, 0x00000000, 0x00000000}, expected {0xffffffff, 0x00000000, 0x00000000, 0x00000000} at (0, 0), sub-resource 0.
d3d10core.c:12958: Test failed: Got {0xffffffff, 0x00000001, 0x00000000, 0x00000000}, expected {0x00000000, 0x00000001, 0x00000000, 0x00000000} at (0, 0), sub-resource 0.
d3d10core.c:12958: Test failed: Got {0x00000001, 0xffffffff, 0x00000000, 0x00000000}, expected {0x00000001, 0x00000000, 0x00000000, 0x00000000} at (0, 0), sub-resource 0.
d3d10core.c:12598: Test failed: Got {-1.00787401e+000, 0.00000000e+000, 1.00000000e+000, 5.03937006e-001}, expected {-1.00000000e+000, 0.00000000e+000, 1.00000000e+000, 5.03937006e-001} at (0, 0), sub-resource 0.
d3d10core.c:16920: Test failed: Resource type 1, test 7: pixel (200, 200) has color 00000000, expected ffff0000.
d3d10core.c:16920: Test failed: Resource type 1, test 7: pixel (280, 200) has color 00000000, expected ffff0000.
d3d10core.c:16920: Test failed: Resource type 1, test 7: pixel (360, 200) has color 00000000, expected ff00ff00.
d3d10core.c:16920: Test failed: Resource type 1, test 7: pixel (440, 200) has color 00000000, expected ff00ff00.
d3d10core.c:16920: Test failed: Resource type 1, test 7: pixel (200, 270) has color 00000000, expected ff0000ff.
d3d10core.c:16920: Test failed: Resource type 1, test 7: pixel (280, 270) has color 00000000, expected ff0000ff.
d3d10core.c:16920: Test failed: Resource type 1, test 7: pixel (360, 270) has color 00000000, expected ff000000.
d3d10core.c:16920: Test failed: Resource type 1, test 7: pixel (440, 270) has color 00000000, expected ff000000.
d3d10core.c:16920: Test failed: Resource type 1, test 8: pixel (200, 200) has color 00000000, expected ffff0000.
d3d10core.c:16920: Test failed: Resource type 1, test 8: pixel (280, 200) has color 00000000, expected ffff0000.
d3d10core.c:16920: Test failed: Resource type 1, test 8: pixel (360, 200) has color 00000000, expected ff00ff00.
d3d10core.c:16920: Test failed: Resource type 1, test 8: pixel (440, 200) has color 00000000, expected ff00ff00.
d3d10core.c:16920: Test failed: Resource type 1, test 8: pixel (200, 270) has color 00000000, expected ff0000ff.
d3d10core.c:16920: Test failed: Resource type 1, test 8: pixel (280, 270) has color 00000000, expected ff0000ff.
d3d10core.c:16920: Test failed: Resource type 1, test 8: pixel (360, 270) has color 00000000, expected ff000000.
d3d10core.c:16920: Test failed: Resource type 1, test 8: pixel (440, 270) has color 00000000, expected ff000000.
d3d10core.c:16920: Test failed: Resource type 2, test 7: pixel (200, 200) has color 00000000, expected ffff0000.
d3d10core.c:16920: Test failed: Resource type 2, test 7: pixel (280, 200) has color 00000000, expected ffff0000.
d3d10core.c:16920: Test failed: Resource type 2, test 7: pixel (360, 200) has color 00000000, expected ff00ff00.
d3d10core.c:16920: Test failed: Resource type 2, test 7: pixel (440, 200) has color 00000000, expected ff00ff00.
d3d10core.c:16920: Test failed: Resource type 2, test 7: pixel (200, 270) has color 00000000, expected ff0000ff.
d3d10core.c:16920: Test failed: Resource type 2, test 7: pixel (280, 270) has color 00000000, expected ff0000ff.
d3d10core.c:16920: Test failed: Resource type 2, test 7: pixel (360, 270) has color 00000000, expected ff000000.
d3d10core.c:16920: Test failed: Resource type 2, test 7: pixel (440, 270) has color 00000000, expected ff000000.
d3d10core.c:16920: Test failed: Resource type 2, test 8: pixel (200, 200) has color 00000000, expected ffff0000.
d3d10core.c:16920: Test failed: Resource type 2, test 8: pixel (280, 200) has color 00000000, expected ffff0000.
d3d10core.c:16920: Test failed: Resource type 2, test 8: pixel (360, 200) has color 00000000, expected ff00ff00.
d3d10core.c:16920: Test failed: Resource type 2, test 8: pixel (440, 200) has color 00000000, expected ff00ff00.
d3d10core.c:16920: Test failed: Resource type 2, test 8: pixel (200, 270) has color 00000000, expected ff0000ff.
d3d10core.c:16920: Test failed: Resource type 2, test 8: pixel (280, 270) has color 00000000, expected ff0000ff.
d3d10core.c:16920: Test failed: Resource type 2, test 8: pixel (360, 270) has color 00000000, expected ff000000.
d3d10core.c:16920: Test failed: Resource type 2, test 8: pixel (440, 270) has color 00000000, expected ff000000.
d3d10core.c:16920: Test failed: Resource type 3, test 7: pixel (200, 200) has color 00000000, expected ffff0000.
d3d10core.c:16920: Test failed: Resource type 3, test 7: pixel (280, 200) has color 00000000, expected ffff0000.
d3d10core.c:16920: Test failed: Resource type 3, test 7: pixel (360, 200) has color 00000000, expected ff00ff00.
d3d10core.c:16920: Test failed: Resource type 3, test 7: pixel (440, 200) has color 00000000, expected ff00ff00.
d3d10core.c:16920: Test failed: Resource type 3, test 7: pixel (200, 270) has color 00000000, expected ff0000ff.
d3d10core.c:16920: Test failed: Resource type 3, test 7: pixel (280, 270) has color 00000000, expected ff0000ff.
d3d10core.c:16920: Test failed: Resource type 3, test 7: pixel (360, 270) has color 00000000, expected ff000000.
d3d10core.c:16920: Test failed: Resource type 3, test 7: pixel (440, 270) has color 00000000, expected ff000000.
d3d10core.c:16920: Test failed: Resource type 3, test 8: pixel (200, 200) has color 00000000, expected ffff0000.
d3d10core.c:16920: Test failed: Resource type 3, test 8: pixel (280, 200) has color 00000000, expected ffff0000.
d3d10core.c:16920: Test failed: Resource type 3, test 8: pixel (360, 200) has color 00000000, expected ff00ff00.
d3d10core.c:16920: Test failed: Resource type 3, test 8: pixel (440, 200) has color 00000000, expected ff00ff00.
d3d10core.c:16920: Test failed: Resource type 3, test 8: pixel (200, 270) has color 00000000, expected ff0000ff.
d3d10core.c:16920: Test failed: Resource type 3, test 8: pixel (280, 270) has color 00000000, expected ff0000ff.
d3d10core.c:16920: Test failed: Resource type 3, test 8: pixel (360, 270) has color 00000000, expected ff000000.
d3d10core.c:16920: Test failed: Resource type 3, test 8: pixel (440, 270) has color 00000000, expected ff000000.
d3d10core.c:15852: Test failed: Got depth 2.51951814e-003, expected 2.51948950e-003.
d3d10core.c:15852: Test failed: Got depth 2.51951814e-003, expected 2.51948950e-003.
d3d10core.c:15852: Test failed: Got depth 1.27950311e-003, expected 1.27948953e-003.
d3d10core.c:15852: Test failed: Got depth 1.27950311e-003, expected 1.27948953e-003.
d3d10core.c:15852: Test failed: Got depth 1.27950311e-003, expected 1.27948953e-003.
d3d10core.c:15852: Test failed: Got depth 1.27950311e-003, expected 1.27948953e-003.
d3d10core.c:15852: Test failed: Got depth 1.27950311e-003, expected 1.27948953e-003.
d3d10core.c:15852: Test failed: Got depth 1.27950311e-003, expected 1.27948953e-003.
d3d10core.c:15852: Test failed: Got depth 5.03277779e-003, expected 5.03897900e-003.
d3d10core.c:15852: Test failed: Got depth 5.03277779e-003, expected 5.03897900e-003.
d3d10core.c:15852: Test failed: Got depth 2.54905224e-003, expected 2.54897905e-003.
d3d10core.c:15852: Test failed: Got depth 7.52645731e-003, expected 7.53897894e-003.
d3d10core.c:15852: Test failed: Got depth 7.52645731e-003, expected 7.53897894e-003.
d3d10core.c:15852: Test failed: Got depth 2.54905224e-003, expected 2.54897905e-003.
d3d10core.c:15852: Test failed: Got depth 1.25139356e-002, expected 1.25389788e-002.
d3d10core.c:15852: Test failed: Got depth 1.25139356e-002, expected 1.25389788e-002.
d3d10core.c:15852: Test failed: Got depth 2.54905224e-003, expected 2.54897905e-003.
d3d10core.c:15852: Test failed: Got depth 6.40938997e-001, expected 6.42538965e-001.
d3d10core.c:15852: Test failed: Got depth 6.40938997e-001, expected 6.42538965e-001.
d3d10core.c:15852: Test failed: Got depth 2.54905224e-003, expected 2.54897905e-003.
d3d10core.c:15852: Test failed: Got depth 2.54905224e-003, expected 2.54897905e-003.
d3d10core.c:15852: Test failed: Got depth 2.54905224e-003, expected 2.54897905e-003.
d3d10core.c:15860: Test failed: Got value 0x149d4 (5.03277809e-003), expected 0x14a3c (5.03897697e-003).
d3d10core.c:15860: Test failed: Got value 0x149d4 (5.03277809e-003), expected 0x14a3c (5.03897697e-003).
d3d10core.c:15860: Test failed: Got value 0x5c5c2 (2.25487961e-002), expected 0x5c5c6 (2.25490345e-002).
d3d10core.c:15860: Test failed: Got value 0x1ed41 (7.52645776e-003), expected 0x1ee13 (7.53897473e-003).
d3d10core.c:15860: Test failed: Got value 0x1ed41 (7.52645776e-003), expected 0x1ee13 (7.53897473e-003).
d3d10core.c:15860: Test failed: Got value 0x5c5c2 (2.25487961e-002), expected 0x5c5c6 (2.25490345e-002).
d3d10core.c:15860: Test failed: Got value 0x3341d (1.25139363e-002), expected 0x335c1 (1.25389703e-002).
d3d10core.c:15860: Test failed: Got value 0x3341d (1.25139363e-002), expected 0x335c1 (1.25389703e-002).
d3d10core.c:15860: Test failed: Got value 0x5c5c2 (2.25487961e-002), expected 0x5c5c6 (2.25490345e-002).
d3d10core.c:15860: Test failed: Got value 0xa41493 (6.40938976e-001), expected 0xa47d6e (6.42538943e-001).
d3d10core.c:15860: Test failed: Got value 0xa41493 (6.40938976e-001), expected 0xa47d6e (6.42538943e-001).
d3d10core.c:15860: Test failed: Got value 0x5c5c2 (2.25487961e-002), expected 0x5c5c6 (2.25490345e-002).
d3d10core.c:15860: Test failed: Got value 0x5c5c2 (2.25487961e-002), expected 0x5c5c6 (2.25490345e-002).
d3d10core.c:15860: Test failed: Got value 0x5c5c2 (2.25487961e-002), expected 0x5c5c6 (2.25490345e-002).
d3d10core.c:15869: Test failed: Got value 0x3d8 (1.50148775e-002), expected 0x3da (1.50453956e-002).
d3d10core.c:15869: Test failed: Got value 0x3d8 (1.50148775e-002), expected 0x3da (1.50453956e-002).
d3d10core.c:15869: Test failed: Got value 0x333 (1.24971389e-002), expected 0x336 (1.25429160e-002).
d3d10core.c:15869: Test failed: Got value 0x333 (1.24971389e-002), expected 0x336 (1.25429160e-002).
d3d10core.c:15869: Test failed: Got value 0x479 (1.74715801e-002), expected 0x47d (1.75326162e-002).
d3d10core.c:15869: Test failed: Got value 0x479 (1.74715801e-002), expected 0x47d (1.75326162e-002).
d3d10core.c:15869: Test failed: Got value 0xa414 (6.40939956e-001), expected 0xa47c (6.42526894e-001).
d3d10core.c:15869: Test failed: Got value 0xa414 (6.40939956e-001), expected 0xa47c (6.42526894e-001).
d3d11
d3d11.c:5782: Test failed: Got unexpected CPrimitives count: 3.
d3d11.c:5785: Test failed: Got unexpected HSInvocations count: 4.
d3d11.c:5786: Test failed: Got unexpected DSInvocations count: 4.
d3d11.c:5787: Test failed: Got unexpected CSInvocations count: 311040.
d3d11.c:5799: Test failed: Got unexpected CPrimitives count: 3.
d3d11.c:5801: Test failed: Got unexpected HSInvocations count: 4.
d3d11.c:5802: Test failed: Got unexpected DSInvocations count: 4.
d3d11.c:5803: Test failed: Got unexpected CSInvocations count: 311040.
d3d11.c:6109: Test succeeded inside todo block: Got unexpected PrimitivesStorageNeeded: 0.
d3d11.c:6119: Test succeeded inside todo block: Got unexpected PrimitivesStorageNeeded: 0.
d3d11.c:8316: Test failed: Test 60: Got unexpected color 0xff0000ff at (0, 0).
d3d11.c:8316: Test failed: Test 60: Got unexpected color 0xff00ffff at (1, 0).
d3d11.c:8316: Test failed: Test 60: Got unexpected color 0xff00ff00 at (2, 0).
d3d11.c:8316: Test failed: Test 60: Got unexpected color 0xffffff00 at (3, 0).
d3d11.c:8316: Test failed: Test 60: Got unexpected color 0xffff0000 at (0, 1).
d3d11.c:8316: Test failed: Test 60: Got unexpected color 0xffff00ff at (1, 1).
d3d11.c:8316: Test failed: Test 60: Got unexpected color 0xff000000 at (2, 1).
d3d11.c:8316: Test failed: Test 60: Got unexpected color 0xff7f7f7f at (3, 1).
d3d11.c:8316: Test failed: Test 60: Got unexpected color 0xffffffff at (0, 2).
d3d11.c:8316: Test failed: Test 60: Got unexpected color 0xffffffff at (1, 2).
d3d11.c:8316: Test failed: Test 60: Got unexpected color 0xffffffff at (2, 2).
d3d11.c:8316: Test failed: Test 60: Got unexpected color 0xff000000 at (3, 2).
d3d11.c:8316: Test failed: Test 60: Got unexpected color 0xffffffff at (0, 3).
d3d11.c:8316: Test failed: Test 60: Got unexpected color 0xff000000 at (2, 3).
d3d11.c:8316: Test failed: Test 60: Got unexpected color 0xff000000 at (3, 3).
d3d11.c:16860: Test failed: Got {-1.00003052e+000, 0.00000000e+000, 1.00000000e+000, 0.00000000e+000}, expected {-1.00000000e+000, 0.00000000e+000, 1.00000000e+000, 0.00000000e+000} at (0, 0), sub-resource 0.
d3d11.c:17958: Test failed: Got {0x00000000, 0x00000000, 0x00000000, 0x00000000}, expected {0x00000000, 0xffffffff, 0x00000000, 0x00000000} at (0, 0), sub-resource 0.
d3d11.c:17958: Test failed: Got {0x00000000, 0x00000000, 0x00000000, 0x00000000}, expected {0xffffffff, 0x00000000, 0x00000000, 0x00000000} at (0, 0), sub-resource 0.
d3d11.c:16860: Test failed: Got {-1.00787401e+000, 0.00000000e+000, 1.00000000e+000, 5.03937006e-001}, expected {-1.00000000e+000, 0.00000000e+000, 1.00000000e+000, 5.03937006e-001} at (0, 0), sub-resource 0.
d3d11.c:17958: Test failed: Got {0xffffffff, 0x00000001, 0x00000000, 0x00000000}, expected {0x00000000, 0x00000001, 0x00000000, 0x00000000} at (0, 0), sub-resource 0.
d3d11.c:17958: Test failed: Got {0x00000001, 0xffffffff, 0x00000000, 0x00000000}, expected {0x00000001, 0x00000000, 0x00000000, 0x00000000} at (0, 0), sub-resource 0.
d3d11.c:27602: Test failed: Resource type 1, test 7: pixel (200, 200) has color 00000000, expected ffff0000.
d3d11.c:27602: Test failed: Resource type 1, test 7: pixel (280, 200) has color 00000000, expected ffff0000.
d3d11.c:27602: Test failed: Resource type 1, test 7: pixel (360, 200) has color 00000000, expected ff00ff00.
d3d11.c:27602: Test failed: Resource type 1, test 7: pixel (440, 200) has color 00000000, expected ff00ff00.
d3d11.c:27602: Test failed: Resource type 1, test 7: pixel (200, 270) has color 00000000, expected ff0000ff.
d3d11.c:27602: Test failed: Resource type 1, test 7: pixel (280, 270) has color 00000000, expected ff0000ff.
d3d11.c:27602: Test failed: Resource type 1, test 7: pixel (360, 270) has color 00000000, expected ff000000.
d3d11.c:27602: Test failed: Resource type 1, test 7: pixel (440, 270) has color 00000000, expected ff000000.
d3d11.c:27602: Test failed: Resource type 1, test 8: pixel (200, 200) has color 00000000, expected ffff0000.
d3d11.c:27602: Test failed: Resource type 1, test 8: pixel (280, 200) has color 00000000, expected ffff0000.
d3d11.c:27602: Test failed: Resource type 1, test 8: pixel (360, 200) has color 00000000, expected ff00ff00.
d3d11.c:27602: Test failed: Resource type 1, test 8: pixel (440, 200) has color 00000000, expected ff00ff00.
d3d11.c:27602: Test failed: Resource type 1, test 8: pixel (200, 270) has color 00000000, expected ff0000ff.
d3d11.c:27602: Test failed: Resource type 1, test 8: pixel (280, 270) has color 00000000, expected ff0000ff.
d3d11.c:27602: Test failed: Resource type 1, test 8: pixel (360, 270) has color 00000000, expected ff000000.
d3d11.c:27602: Test failed: Resource type 1, test 8: pixel (440, 270) has color 00000000, expected ff000000.
d3d11.c:27602: Test failed: Resource type 2, test 7: pixel (200, 200) has color 00000000, expected ffff0000.
d3d11.c:27602: Test failed: Resource type 2, test 7: pixel (280, 200) has color 00000000, expected ffff0000.
d3d11.c:27602: Test failed: Resource type 2, test 7: pixel (360, 200) has color 00000000, expected ff00ff00.
d3d11.c:27602: Test failed: Resource type 2, test 7: pixel (440, 200) has color 00000000, expected ff00ff00.
d3d11.c:27602: Test failed: Resource type 2, test 7: pixel (200, 270) has color 00000000, expected ff0000ff.
d3d11.c:27602: Test failed: Resource type 2, test 7: pixel (280, 270) has color 00000000, expected ff0000ff.
d3d11.c:27602: Test failed: Resource type 2, test 7: pixel (360, 270) has color 00000000, expected ff000000.
d3d11.c:27602: Test failed: Resource type 2, test 7: pixel (440, 270) has color 00000000, expected ff000000.
d3d11.c:27602: Test failed: Resource type 2, test 8: pixel (200, 200) has color 00000000, expected ffff0000.
d3d11.c:27602: Test failed: Resource type 2, test 8: pixel (280, 200) has color 00000000, expected ffff0000.
d3d11.c:27602: Test failed: Resource type 2, test 8: pixel (360, 200) has color 00000000, expected ff00ff00.
d3d11.c:27602: Test failed: Resource type 2, test 8: pixel (440, 200) has color 00000000, expected ff00ff00.
d3d11.c:27602: Test failed: Resource type 2, test 8: pixel (200, 270) has color 00000000, expected ff0000ff.
d3d11.c:27602: Test failed: Resource type 2, test 8: pixel (280, 270) has color 00000000, expected ff0000ff.
d3d11.c:27602: Test failed: Resource type 2, test 8: pixel (360, 270) has color 00000000, expected ff000000.
d3d11.c:27602: Test failed: Resource type 2, test 8: pixel (440, 270) has color 00000000, expected ff000000.
d3d11.c:27602: Test failed: Resource type 3, test 7: pixel (200, 200) has color 00000000, expected ffff0000.
d3d11.c:27602: Test failed: Resource type 3, test 7: pixel (280, 200) has color 00000000, expected ffff0000.
d3d11.c:27602: Test failed: Resource type 3, test 7: pixel (360, 200) has color 00000000, expected ff00ff00.
d3d11.c:27602: Test failed: Resource type 3, test 7: pixel (440, 200) has color 00000000, expected ff00ff00.
d3d11.c:27602: Test failed: Resource type 3, test 7: pixel (200, 270) has color 00000000, expected ff0000ff.
d3d11.c:27602: Test failed: Resource type 3, test 7: pixel (280, 270) has color 00000000, expected ff0000ff.
d3d11.c:27602: Test failed: Resource type 3, test 7: pixel (360, 270) has color 00000000, expected ff000000.
d3d11.c:27602: Test failed: Resource type 3, test 7: pixel (440, 270) has color 00000000, expected ff000000.
d3d11.c:27602: Test failed: Resource type 3, test 8: pixel (200, 200) has color 00000000, expected ffff0000.
d3d11.c:27602: Test failed: Resource type 3, test 8: pixel (280, 200) has color 00000000, expected ffff0000.
d3d11.c:27602: Test failed: Resource type 3, test 8: pixel (360, 200) has color 00000000, expected ff00ff00.
d3d11.c:27602: Test failed: Resource type 3, test 8: pixel (440, 200) has color 00000000, expected ff00ff00.
d3d11.c:27602: Test failed: Resource type 3, test 8: pixel (200, 270) has color 00000000, expected ff0000ff.
d3d11.c:27602: Test failed: Resource type 3, test 8: pixel (280, 270) has color 00000000, expected ff0000ff.
d3d11.c:27602: Test failed: Resource type 3, test 8: pixel (360, 270) has color 00000000, expected ff000000.
d3d11.c:27602: Test failed: Resource type 3, test 8: pixel (440, 270) has color 00000000, expected ff000000.
d3d11.c:25838: Test failed: Got depth 2.51951814e-003, expected 2.51948950e-003.
d3d11.c:25838: Test failed: Got depth 2.51951814e-003, expected 2.51948950e-003.
d3d11.c:25838: Test failed: Got depth 1.27950311e-003, expected 1.27948953e-003.
d3d11.c:25838: Test failed: Got depth 1.27950311e-003, expected 1.27948953e-003.
d3d11.c:25838: Test failed: Got depth 1.27950311e-003, expected 1.27948953e-003.
d3d11.c:25838: Test failed: Got depth 1.27950311e-003, expected 1.27948953e-003.
d3d11.c:25838: Test failed: Got depth 1.27950311e-003, expected 1.27948953e-003.
d3d11.c:25838: Test failed: Got depth 1.27950311e-003, expected 1.27948953e-003.
d3d11.c:25838: Test failed: Got depth 5.03277779e-003, expected 5.03897900e-003.
d3d11.c:25838: Test failed: Got depth 5.03277779e-003, expected 5.03897900e-003.
d3d11.c:25838: Test failed: Got depth 2.54905224e-003, expected 2.54897905e-003.
d3d11.c:25838: Test failed: Got depth 7.52645731e-003, expected 7.53897894e-003.
d3d11.c:25838: Test failed: Got depth 7.52645731e-003, expected 7.53897894e-003.
d3d11.c:25838: Test failed: Got depth 2.54905224e-003, expected 2.54897905e-003.
d3d11.c:25838: Test failed: Got depth 1.25139356e-002, expected 1.25389788e-002.
d3d11.c:25838: Test failed: Got depth 1.25139356e-002, expected 1.25389788e-002.
d3d11.c:25838: Test failed: Got depth 2.54905224e-003, expected 2.54897905e-003.
d3d11.c:25838: Test failed: Got depth 6.40938997e-001, expected 6.42538965e-001.
d3d11.c:25838: Test failed: Got depth 6.40938997e-001, expected 6.42538965e-001.
d3d11.c:25838: Test failed: Got depth 2.54905224e-003, expected 2.54897905e-003.
d3d11.c:25838: Test failed: Got depth 2.54905224e-003, expected 2.54897905e-003.
d3d11.c:25838: Test failed: Got depth 2.54905224e-003, expected 2.54897905e-003.
d3d11.c:25846: Test failed: Got value 0x149d4 (5.03277809e-003), expected 0x14a3c (5.03897697e-003).
d3d11.c:25846: Test failed: Got value 0x149d4 (5.03277809e-003), expected 0x14a3c (5.03897697e-003).
d3d11.c:25846: Test failed: Got value 0x5c5c2 (2.25487961e-002), expected 0x5c5c6 (2.25490345e-002).
d3d11.c:25846: Test failed: Got value 0x1ed41 (7.52645776e-003), expected 0x1ee13 (7.53897473e-003).
d3d11.c:25846: Test failed: Got value 0x1ed41 (7.52645776e-003), expected 0x1ee13 (7.53897473e-003).
d3d11.c:25846: Test failed: Got value 0x5c5c2 (2.25487961e-002), expected 0x5c5c6 (2.25490345e-002).
d3d11.c:25846: Test failed: Got value 0x3341d (1.25139363e-002), expected 0x335c1 (1.25389703e-002).
d3d11.c:25846: Test failed: Got value 0x3341d (1.25139363e-002), expected 0x335c1 (1.25389703e-002).
d3d11.c:25846: Test failed: Got value 0x5c5c2 (2.25487961e-002), expected 0x5c5c6 (2.25490345e-002).
d3d11.c:25846: Test failed: Got value 0xa41493 (6.40938976e-001), expected 0xa47d6e (6.42538943e-001).
d3d11.c:25846: Test failed: Got value 0xa41493 (6.40938976e-001), expected 0xa47d6e (6.42538943e-001).
d3d11.c:25846: Test failed: Got value 0x5c5c2 (2.25487961e-002), expected 0x5c5c6 (2.25490345e-002).
d3d11.c:25846: Test failed: Got value 0x5c5c2 (2.25487961e-002), expected 0x5c5c6 (2.25490345e-002).
d3d11.c:25846: Test failed: Got value 0x5c5c2 (2.25487961e-002), expected 0x5c5c6 (2.25490345e-002).
d3d11.c:25855: Test failed: Got value 0x3d8 (1.50148775e-002), expected 0x3da (1.50453956e-002).
d3d11.c:25855: Test failed: Got value 0x3d8 (1.50148775e-002), expected 0x3da (1.50453956e-002).
d3d11.c:25855: Test failed: Got value 0x333 (1.24971389e-002), expected 0x336 (1.25429160e-002).
d3d11.c:25855: Test failed: Got value 0x333 (1.24971389e-002), expected 0x336 (1.25429160e-002).
d3d11.c:25855: Test failed: Got value 0x479 (1.74715801e-002), expected 0x47d (1.75326162e-002).
d3d11.c:25855: Test failed: Got value 0x479 (1.74715801e-002), expected 0x47d (1.75326162e-002).
d3d11.c:25855: Test failed: Got value 0xa414 (6.40939956e-001), expected 0xa47c (6.42526894e-001).
d3d11.c:25855: Test failed: Got value 0xa414 (6.40939956e-001), expected 0xa47c (6.42526894e-001).
d3d8
device.c:3165: Test failed: Expected message 0x1c for window 0x1, but didn't receive it
visual.c:6623: Test failed: Expected color 0x00000000, got 0x000000ff, format D3DFMT_Q8W8V8U8, test 0, location 3x2.
visual.c:6623: Test failed: Expected color 0x00000000, got 0x000000ff, format D3DFMT_Q8W8V8U8, test 2, location 3x2.
visual.c:7464: Test failed: Got unexpected color 0x0000ff00 (case 0, 3, size 0).
visual.c:7464: Test failed: Got unexpected color 0x0000ff00 (case 1, 3, size 0).
visual.c:7464: Test failed: Got unexpected color 0x0000ff00 (case 2, 3, size 0).
visual.c:7464: Test failed: Got unexpected color 0x0000ff00 (case 3, 3, size 0).
visual.c:7464: Test failed: Got unexpected color 0x0000ff00 (case 4, 7, size 0).
visual.c:7464: Test failed: Got unexpected color 0x0000ff00 (case 5, 7, size 0).
visual.c:8791: Test failed: Test 0 shading has color1 000000ff, expected 0000ff00.
visual.c:8791: Test failed: Test 6 shading has color1 000000ff, expected 0000ff00.
visual.c:8791: Test failed: Test 10 shading has color1 000000ff, expected 0000ff00.
visual.c:8791: Test failed: Test 11 shading has color1 000000ff, expected 0000ff00.
visual.c:10297: Test failed: Expected unsynchronised map for flags 0x1000.
visual.c:10297: Test failed: Expected unsynchronised map for flags 0x3000.
d3d9
device.c:4624: Test failed: Received unexpected WM_SIZE message.
device.c:6094: Test failed: Got unexpected hr 0x1.
device.c:6098: Test failed: Got unexpected hr 0x1.
device.c:6099: Test failed: Got unexpected query result 0xffffffffffffffff.
device: Timeout
visual.c:9410: Test failed: Test 0 shading has color1 000000ff, expected 0000ff00.
visual.c:9410: Test failed: Test 6 shading has color1 000000ff, expected 0000ff00.
visual.c:9410: Test failed: Test 10 shading has color1 000000ff, expected 0000ff00.
visual.c:9410: Test failed: Test 11 shading has color1 000000ff, expected 0000ff00.
visual.c:9410: Test failed: Test 12 shading has color1 000000ff, expected 0000ff00.
visual.c:11972: Test failed: Got unexpected color 0x0000ff00 (case 0, 3, size 0).
visual.c:11972: Test failed: Got unexpected color 0x0000ff00 (case 1, 3, size 0).
visual.c:11972: Test failed: Got unexpected color 0x0000ff00 (case 2, 3, size 0).
visual.c:11972: Test failed: Got unexpected color 0x0000ff00 (case 3, 3, size 0).
visual.c:11972: Test failed: Got unexpected color 0x0000ff00 (case 4, 3, size 0).
visual.c:11972: Test failed: Got unexpected color 0x00ff0000 (case 5, 3, size 0).
visual.c:11972: Test failed: Got unexpected color 0x0000ff00 (case 6, 3, size 0).
visual.c:11972: Test failed: Got unexpected color 0x00ff0000 (case 7, 3, size 0).
visual.c:11972: Test failed: Got unexpected color 0x0000ff00 (case 8, 3, size 0).
visual.c:11972: Test failed: Got unexpected color 0x00ff0000 (case 9, 3, size 0).
visual.c:11972: Test failed: Got unexpected color 0x0000ff00 (case 10, 7, size 0).
visual.c:11972: Test failed: Got unexpected color 0x0000ff00 (case 11, 7, size 0).
visual.c:11972: Test failed: Got unexpected color 0x0000ff00 (case 12, 7, size 0).
visual.c:20801: Test failed: Expected color 0x00000000, got 0x000000ff, format D3DFMT_Q8W8V8U8, test 0, location 3x2.
visual.c:20801: Test failed: Expected color 0x00000000, got 0x000000ff, format D3DFMT_Q8W8V8U8, test 2, location 3x2.
visual.c:22064: Test failed: Got unexpected color 00ffffff at x=64, format 80.
visual.c:22071: Test failed: Got unexpected color 000000ff at x=194, format 80.
visual.c:22081: Test failed: Got unexpected color 00000000 at x=446, format 80.
visual.c:22064: Test failed: Got unexpected color 00ffffff at x=64, format 77.
visual.c:22071: Test failed: Got unexpected color 000000ff at x=194, format 77.
visual.c:22081: Test failed: Got unexpected color 00000000 at x=446, format 77.
visual.c:22064: Test failed: Got unexpected color 00ffffff at x=64, format 75.
visual.c:22071: Test failed: Got unexpected color 000000ff at x=194, format 75.
visual.c:22081: Test failed: Got unexpected color 00000000 at x=446, format 75.
visual.c:22064: Test failed: Got unexpected color 00ffffff at x=64, format 1515474505.
visual.c:22071: Test failed: Got unexpected color 000000ff at x=194, format 1515474505.
visual.c:22081: Test failed: Got unexpected color 00000000 at x=446, format 1515474505.
visual.c:25211: Test failed: Expected unsynchronised map for flags 0x1000.
visual.c:25211: Test failed: Expected unsynchronised map for flags 0x3000.
ddraw
ddraw2.c:9700: Test failed: Test 0 shading has color1 000000ff, expected 0000ff00.
ddraw4.c:11476: Test failed: Test 0 shading has color1 000000ff, expected 0000ff00.
ddraw7.c:11485: Test failed: Test 0 shading has color1 000000ff, expected 0000ff00.
ddraw7.c:14422: Test failed: Expected unsynchronised map for flags 0x1000.
ddraw7.c:14422: Test failed: Expected unsynchronised map for flags 0x3000.
dinput
dinput.c:405: Test failed: guidProduct.Data2 is 7734
dinput.c:407: Test failed: guidProduct.Data3 is 11d2
dinput.c:409: Test failed: guidProduct.Data4 does not match: {9e573ed9-7734-11d2-8d4a-23903fb6bdf7}
dinput.c:405: Test failed: guidProduct.Data2 is 7734
dinput.c:407: Test failed: guidProduct.Data3 is 11d2
dinput.c:409: Test failed: guidProduct.Data4 does not match: {9e573ed9-7734-11d2-8d4a-23903fb6bdf7}
joystick.c:405: Test failed: IDirectInput_GetProperty() for DIPROP_GUIDANDPATH failed: 80004001
joystick.c:416: Test failed: DIPROP_GUIDANDPATH path has wrong format. Expected count: 2 Got: -1 Path: L""
joystick.c:418: Test failed: DIPROP_GUIDANDPATH path should contain either 'ig_' or 'mi_' substring. Path: L""
joystick.c:405: Test failed: IDirectInput_GetProperty() for DIPROP_GUIDANDPATH failed: 80004001
joystick.c:416: Test failed: DIPROP_GUIDANDPATH path has wrong format. Expected count: 2 Got: -1 Path: L""
joystick.c:418: Test failed: DIPROP_GUIDANDPATH path should contain either 'ig_' or 'mi_' substring. Path: L""
joystick.c:405: Test failed: IDirectInput_GetProperty() for DIPROP_GUIDANDPATH failed: 80004001
joystick.c:416: Test failed: DIPROP_GUIDANDPATH path has wrong format. Expected count: 2 Got: -1 Path: L""
joystick.c:418: Test failed: DIPROP_GUIDANDPATH path should contain either 'ig_' or 'mi_' substring. Path: L""
mouse.c:152: Test failed: Failed: 00000001
mouse.c:158: Test failed: Failed: 80070005
mouse.c:161: Test failed: Failed: 00000001
mouse.c:164: Test failed: Failed: 80070005
mouse.c:178: Test failed: GetDeviceData() failed: 00000000 cnt:0
dxgi
dxgi.c:2116: Test failed: Failed to get containing output, hr 0x887a0002.
Unhandled exception: page fault on execute access to 0x08455355 in 32-bit code (0x08455355).
gdi32
driver.c:81: Test failed: Got unexpected return code 0xc0000001.
driver.c:93: Test failed: Got unexpected value 0.
driver.c:97: Test failed: Got unexpected return code 0xc000000d.
kernel32
comm.c:919: Test failed: OutQueue should not be empty
Unhandled exception: page fault on write access to 0x00000000 in 32-bit code (0x00439de2).
debugger: Timeout
mmdevapi
render.c:1349: Test failed: Activation failed with 8889000a
render.c:1880: Test failed: Activation failed with 8889000a
mstask
task_scheduler.c:498: Test failed: got 0x80070020
ole32
clipboard.c:1049: Test failed: OleIsCurrentClipboard returned 0
clipboard.c:1117: Test failed: 1 WM_DRAWCLIPBOARD received
rsaenh
rsaenh.c:2391: Test failed: 8009000d
services.exe
service.c:422: Test failed: service: Unexpected monitor rcMonitor values: {1024,0,2048,739}
service.c:422: Test failed: service: Unexpected monitor rcWork values: {1024,0,2048,739}
service.c:422: Test failed: service: Unexpected szDevice received: \\.\DISPLAY2
service.c:422: Test failed: service: Unexpected secondary monitor info.
service.c:422: Test failed: service: Callback got called less or more than once. 2
urlmon
protocol.c:3656: Test failed: wait timed out
protocol: Timeout
url: Timeout
user32
msg.c:5148: Test succeeded inside todo block: ShowWindow(SW_SHOWMINIMIZED):overlapped: marked "todo_wine" but succeeds
sysparams.c:3251: Test failed: 0: wrong virt desktop rect (0,0)-(2048,768) expected (0,0)-(1024,768)
sysparams.c:3265: Test failed: 0: wrong caps virt desktop rect (0,0)-(2048,768) expected (0,0)-(1024,768)
sysparams.c:3251: Test failed: 1: wrong virt desktop rect (0,0)-(2048,768) expected (0,0)-(1024,768)
sysparams.c:3265: Test failed: 1: wrong caps virt desktop rect (0,0)-(2048,768) expected (0,0)-(1024,768)
sysparams.c:3251: Test failed: 2: wrong virt desktop rect (0,0)-(2048,768) expected (0,0)-(1024,768)
sysparams.c:3265: Test failed: 2: wrong caps virt desktop rect (0,0)-(2048,768) expected (0,0)-(1024,768)
sysparams.c:3343: Test failed: 0/0: wrong desktop resolution (0,0)-(2048,768) expected (0,0)-(1024,768)
sysparams.c:3343: Test failed: 0/1: wrong desktop resolution (0,0)-(2048,768) expected (0,0)-(1024,768)
sysparams.c:3343: Test failed: 0/2: wrong desktop resolution (0,0)-(2048,768) expected (0,0)-(1024,768)
sysparams.c:3343: Test failed: 1/0: wrong desktop resolution (0,0)-(2048,768) expected (0,0)-(1024,768)
sysparams.c:3343: Test failed: 1/1: wrong desktop resolution (0,0)-(2048,768) expected (0,0)-(1024,768)
sysparams.c:3343: Test failed: 1/2: wrong desktop resolution (0,0)-(2048,768) expected (0,0)-(1024,768)
sysparams.c:3343: Test failed: 2/0: wrong desktop resolution (0,0)-(2048,768) expected (0,0)-(1024,768)
sysparams.c:3343: Test failed: 2/1: wrong desktop resolution (0,0)-(2048,768) expected (0,0)-(1024,768)
sysparams.c:3343: Test failed: 2/2: wrong desktop resolution (0,0)-(2048,768) expected (0,0)-(1024,768)
wininet
ftp: Timeout
http.c:6174: Test failed: req_error = 12045
http.c:6213: Test failed: Unexpected cert errors 12045, skipping security flags tests
http.c:4777: Test failed: expected 1 pending read, got 2
Report errors
d3d11:d3d11 prints too much data (35751 bytes)
dxgi:dxgi crashed (c0000005)
kernel32:virtual prints too much data (91050 bytes)
opengl32:opengl has no test summary line (early exit of the main process?)
opengl32:opengl has unaccounted for todo messages
opengl32:opengl has unaccounted for skip messages
user32:msg prints too much data (35220 bytes)
vulkan-1:vulkan had no start line (or it is garbled)
Task log
X Error of failed request:  BadValue (integer parameter out of range for operation)
  Major opcode of failed request:  53 (X_CreatePixmap)

debian10 (32 bit French tests)

Debian 10 / vm4Debian 10 configured for Wine. Runs fvwm with 2 screens. [CPU:4*host RAM:3GB disk:virtio-scsi eth:virtio snd:ich9 GPU:qxl display:spice testagentd:1.7]
Missions: win32,lang=fr_FR
32 bit French report
d3d10core
d3d10core.c:4773: Test failed: Got unexpected CPrimitives count: 3.
d3d10core.c:4787: Test failed: Got unexpected CPrimitives count: 3.
d3d10core.c:4970: Test succeeded inside todo block: Got unexpected PrimitivesStorageNeeded: 0.
d3d10core.c:4980: Test succeeded inside todo block: Got unexpected PrimitivesStorageNeeded: 0.
d3d10core.c:7479: Test failed: Test 52: Got unexpected color 0xff0000ff at (0, 0).
d3d10core.c:7479: Test failed: Test 52: Got unexpected color 0xff00ffff at (1, 0).
d3d10core.c:7479: Test failed: Test 52: Got unexpected color 0xff00ff00 at (2, 0).
d3d10core.c:7479: Test failed: Test 52: Got unexpected color 0xffffff00 at (3, 0).
d3d10core.c:7479: Test failed: Test 52: Got unexpected color 0xffff0000 at (0, 1).
d3d10core.c:7479: Test failed: Test 52: Got unexpected color 0xffff00ff at (1, 1).
d3d10core.c:7479: Test failed: Test 52: Got unexpected color 0xff000000 at (2, 1).
d3d10core.c:7479: Test failed: Test 52: Got unexpected color 0xff7f7f7f at (3, 1).
d3d10core.c:7479: Test failed: Test 52: Got unexpected color 0xffffffff at (0, 2).
d3d10core.c:7479: Test failed: Test 52: Got unexpected color 0xffffffff at (1, 2).
d3d10core.c:7479: Test failed: Test 52: Got unexpected color 0xffffffff at (2, 2).
d3d10core.c:7479: Test failed: Test 52: Got unexpected color 0xff000000 at (3, 2).
d3d10core.c:7479: Test failed: Test 52: Got unexpected color 0xffffffff at (0, 3).
d3d10core.c:7479: Test failed: Test 52: Got unexpected color 0xff000000 at (2, 3).
d3d10core.c:7479: Test failed: Test 52: Got unexpected color 0xff000000 at (3, 3).
d3d10core.c:12598: Test failed: Got {-1.00003052e+000, 0.00000000e+000, 1.00000000e+000, 0.00000000e+000}, expected {-1.00000000e+000, 0.00000000e+000, 1.00000000e+000, 0.00000000e+000} at (0, 0), sub-resource 0.
d3d10core.c:12958: Test failed: Got {0x00000000, 0x00000000, 0x00000000, 0x00000000}, expected {0x00000000, 0xffffffff, 0x00000000, 0x00000000} at (0, 0), sub-resource 0.
d3d10core.c:12958: Test failed: Got {0x00000000, 0x00000000, 0x00000000, 0x00000000}, expected {0xffffffff, 0x00000000, 0x00000000, 0x00000000} at (0, 0), sub-resource 0.
d3d10core.c:12958: Test failed: Got {0xffffffff, 0x00000001, 0x00000000, 0x00000000}, expected {0x00000000, 0x00000001, 0x00000000, 0x00000000} at (0, 0), sub-resource 0.
d3d10core.c:12958: Test failed: Got {0x00000001, 0xffffffff, 0x00000000, 0x00000000}, expected {0x00000001, 0x00000000, 0x00000000, 0x00000000} at (0, 0), sub-resource 0.
d3d10core.c:12598: Test failed: Got {-1.00787401e+000, 0.00000000e+000, 1.00000000e+000, 5.03937006e-001}, expected {-1.00000000e+000, 0.00000000e+000, 1.00000000e+000, 5.03937006e-001} at (0, 0), sub-resource 0.
d3d10core.c:16920: Test failed: Resource type 1, test 7: pixel (200, 200) has color 00000000, expected ffff0000.
d3d10core.c:16920: Test failed: Resource type 1, test 7: pixel (280, 200) has color 00000000, expected ffff0000.
d3d10core.c:16920: Test failed: Resource type 1, test 7: pixel (360, 200) has color 00000000, expected ff00ff00.
d3d10core.c:16920: Test failed: Resource type 1, test 7: pixel (440, 200) has color 00000000, expected ff00ff00.
d3d10core.c:16920: Test failed: Resource type 1, test 7: pixel (200, 270) has color 00000000, expected ff0000ff.
d3d10core.c:16920: Test failed: Resource type 1, test 7: pixel (280, 270) has color 00000000, expected ff0000ff.
d3d10core.c:16920: Test failed: Resource type 1, test 7: pixel (360, 270) has color 00000000, expected ff000000.
d3d10core.c:16920: Test failed: Resource type 1, test 7: pixel (440, 270) has color 00000000, expected ff000000.
d3d10core.c:16920: Test failed: Resource type 1, test 8: pixel (200, 200) has color 00000000, expected ffff0000.
d3d10core.c:16920: Test failed: Resource type 1, test 8: pixel (280, 200) has color 00000000, expected ffff0000.
d3d10core.c:16920: Test failed: Resource type 1, test 8: pixel (360, 200) has color 00000000, expected ff00ff00.
d3d10core.c:16920: Test failed: Resource type 1, test 8: pixel (440, 200) has color 00000000, expected ff00ff00.
d3d10core.c:16920: Test failed: Resource type 1, test 8: pixel (200, 270) has color 00000000, expected ff0000ff.
d3d10core.c:16920: Test failed: Resource type 1, test 8: pixel (280, 270) has color 00000000, expected ff0000ff.
d3d10core.c:16920: Test failed: Resource type 1, test 8: pixel (360, 270) has color 00000000, expected ff000000.
d3d10core.c:16920: Test failed: Resource type 1, test 8: pixel (440, 270) has color 00000000, expected ff000000.
d3d10core.c:16920: Test failed: Resource type 2, test 7: pixel (200, 200) has color 00000000, expected ffff0000.
d3d10core.c:16920: Test failed: Resource type 2, test 7: pixel (280, 200) has color 00000000, expected ffff0000.
d3d10core.c:16920: Test failed: Resource type 2, test 7: pixel (360, 200) has color 00000000, expected ff00ff00.
d3d10core.c:16920: Test failed: Resource type 2, test 7: pixel (440, 200) has color 00000000, expected ff00ff00.
d3d10core.c:16920: Test failed: Resource type 2, test 7: pixel (200, 270) has color 00000000, expected ff0000ff.
d3d10core.c:16920: Test failed: Resource type 2, test 7: pixel (280, 270) has color 00000000, expected ff0000ff.
d3d10core.c:16920: Test failed: Resource type 2, test 7: pixel (360, 270) has color 00000000, expected ff000000.
d3d10core.c:16920: Test failed: Resource type 2, test 7: pixel (440, 270) has color 00000000, expected ff000000.
d3d10core.c:16920: Test failed: Resource type 2, test 8: pixel (200, 200) has color 00000000, expected ffff0000.
d3d10core.c:16920: Test failed: Resource type 2, test 8: pixel (280, 200) has color 00000000, expected ffff0000.
d3d10core.c:16920: Test failed: Resource type 2, test 8: pixel (360, 200) has color 00000000, expected ff00ff00.
d3d10core.c:16920: Test failed: Resource type 2, test 8: pixel (440, 200) has color 00000000, expected ff00ff00.
d3d10core.c:16920: Test failed: Resource type 2, test 8: pixel (200, 270) has color 00000000, expected ff0000ff.
d3d10core.c:16920: Test failed: Resource type 2, test 8: pixel (280, 270) has color 00000000, expected ff0000ff.
d3d10core.c:16920: Test failed: Resource type 2, test 8: pixel (360, 270) has color 00000000, expected ff000000.
d3d10core.c:16920: Test failed: Resource type 2, test 8: pixel (440, 270) has color 00000000, expected ff000000.
d3d10core.c:16920: Test failed: Resource type 3, test 7: pixel (200, 200) has color 00000000, expected ffff0000.
d3d10core.c:16920: Test failed: Resource type 3, test 7: pixel (280, 200) has color 00000000, expected ffff0000.
d3d10core.c:16920: Test failed: Resource type 3, test 7: pixel (360, 200) has color 00000000, expected ff00ff00.
d3d10core.c:16920: Test failed: Resource type 3, test 7: pixel (440, 200) has color 00000000, expected ff00ff00.
d3d10core.c:16920: Test failed: Resource type 3, test 7: pixel (200, 270) has color 00000000, expected ff0000ff.
d3d10core.c:16920: Test failed: Resource type 3, test 7: pixel (280, 270) has color 00000000, expected ff0000ff.
d3d10core.c:16920: Test failed: Resource type 3, test 7: pixel (360, 270) has color 00000000, expected ff000000.
d3d10core.c:16920: Test failed: Resource type 3, test 7: pixel (440, 270) has color 00000000, expected ff000000.
d3d10core.c:16920: Test failed: Resource type 3, test 8: pixel (200, 200) has color 00000000, expected ffff0000.
d3d10core.c:16920: Test failed: Resource type 3, test 8: pixel (280, 200) has color 00000000, expected ffff0000.
d3d10core.c:16920: Test failed: Resource type 3, test 8: pixel (360, 200) has color 00000000, expected ff00ff00.
d3d10core.c:16920: Test failed: Resource type 3, test 8: pixel (440, 200) has color 00000000, expected ff00ff00.
d3d10core.c:16920: Test failed: Resource type 3, test 8: pixel (200, 270) has color 00000000, expected ff0000ff.
d3d10core.c:16920: Test failed: Resource type 3, test 8: pixel (280, 270) has color 00000000, expected ff0000ff.
d3d10core.c:16920: Test failed: Resource type 3, test 8: pixel (360, 270) has color 00000000, expected ff000000.
d3d10core.c:16920: Test failed: Resource type 3, test 8: pixel (440, 270) has color 00000000, expected ff000000.
d3d10core.c:15852: Test failed: Got depth 2.51951814e-003, expected 2.51948950e-003.
d3d10core.c:15852: Test failed: Got depth 2.51951814e-003, expected 2.51948950e-003.
d3d10core.c:15852: Test failed: Got depth 1.27950311e-003, expected 1.27948953e-003.
d3d10core.c:15852: Test failed: Got depth 1.27950311e-003, expected 1.27948953e-003.
d3d10core.c:15852: Test failed: Got depth 1.27950311e-003, expected 1.27948953e-003.
d3d10core.c:15852: Test failed: Got depth 1.27950311e-003, expected 1.27948953e-003.
d3d10core.c:15852: Test failed: Got depth 1.27950311e-003, expected 1.27948953e-003.
d3d10core.c:15852: Test failed: Got depth 1.27950311e-003, expected 1.27948953e-003.
d3d10core.c:15852: Test failed: Got depth 5.03277779e-003, expected 5.03897900e-003.
d3d10core.c:15852: Test failed: Got depth 5.03277779e-003, expected 5.03897900e-003.
d3d10core.c:15852: Test failed: Got depth 2.54905224e-003, expected 2.54897905e-003.
d3d10core.c:15852: Test failed: Got depth 7.52645731e-003, expected 7.53897894e-003.
d3d10core.c:15852: Test failed: Got depth 7.52645731e-003, expected 7.53897894e-003.
d3d10core.c:15852: Test failed: Got depth 2.54905224e-003, expected 2.54897905e-003.
d3d10core.c:15852: Test failed: Got depth 1.25139356e-002, expected 1.25389788e-002.
d3d10core.c:15852: Test failed: Got depth 1.25139356e-002, expected 1.25389788e-002.
d3d10core.c:15852: Test failed: Got depth 2.54905224e-003, expected 2.54897905e-003.
d3d10core.c:15852: Test failed: Got depth 6.40938997e-001, expected 6.42538965e-001.
d3d10core.c:15852: Test failed: Got depth 6.40938997e-001, expected 6.42538965e-001.
d3d10core.c:15852: Test failed: Got depth 2.54905224e-003, expected 2.54897905e-003.
d3d10core.c:15852: Test failed: Got depth 2.54905224e-003, expected 2.54897905e-003.
d3d10core.c:15852: Test failed: Got depth 2.54905224e-003, expected 2.54897905e-003.
d3d10core.c:15860: Test failed: Got value 0x149d4 (5.03277809e-003), expected 0x14a3c (5.03897697e-003).
d3d10core.c:15860: Test failed: Got value 0x149d4 (5.03277809e-003), expected 0x14a3c (5.03897697e-003).
d3d10core.c:15860: Test failed: Got value 0x5c5c2 (2.25487961e-002), expected 0x5c5c6 (2.25490345e-002).
d3d10core.c:15860: Test failed: Got value 0x1ed41 (7.52645776e-003), expected 0x1ee13 (7.53897473e-003).
d3d10core.c:15860: Test failed: Got value 0x1ed41 (7.52645776e-003), expected 0x1ee13 (7.53897473e-003).
d3d10core.c:15860: Test failed: Got value 0x5c5c2 (2.25487961e-002), expected 0x5c5c6 (2.25490345e-002).
d3d10core.c:15860: Test failed: Got value 0x3341d (1.25139363e-002), expected 0x335c1 (1.25389703e-002).
d3d10core.c:15860: Test failed: Got value 0x3341d (1.25139363e-002), expected 0x335c1 (1.25389703e-002).
d3d10core.c:15860: Test failed: Got value 0x5c5c2 (2.25487961e-002), expected 0x5c5c6 (2.25490345e-002).
d3d10core.c:15860: Test failed: Got value 0xa41493 (6.40938976e-001), expected 0xa47d6e (6.42538943e-001).
d3d10core.c:15860: Test failed: Got value 0xa41493 (6.40938976e-001), expected 0xa47d6e (6.42538943e-001).
d3d10core.c:15860: Test failed: Got value 0x5c5c2 (2.25487961e-002), expected 0x5c5c6 (2.25490345e-002).
d3d10core.c:15860: Test failed: Got value 0x5c5c2 (2.25487961e-002), expected 0x5c5c6 (2.25490345e-002).
d3d10core.c:15860: Test failed: Got value 0x5c5c2 (2.25487961e-002), expected 0x5c5c6 (2.25490345e-002).
d3d10core.c:15869: Test failed: Got value 0x3d8 (1.50148775e-002), expected 0x3da (1.50453956e-002).
d3d10core.c:15869: Test failed: Got value 0x3d8 (1.50148775e-002), expected 0x3da (1.50453956e-002).
d3d10core.c:15869: Test failed: Got value 0x333 (1.24971389e-002), expected 0x336 (1.25429160e-002).
d3d10core.c:15869: Test failed: Got value 0x333 (1.24971389e-002), expected 0x336 (1.25429160e-002).
d3d10core.c:15869: Test failed: Got value 0x479 (1.74715801e-002), expected 0x47d (1.75326162e-002).
d3d10core.c:15869: Test failed: Got value 0x479 (1.74715801e-002), expected 0x47d (1.75326162e-002).
d3d10core.c:15869: Test failed: Got value 0xa414 (6.40939956e-001), expected 0xa47c (6.42526894e-001).
d3d10core.c:15869: Test failed: Got value 0xa414 (6.40939956e-001), expected 0xa47c (6.42526894e-001).
d3d11
d3d11.c:5782: Test failed: Got unexpected CPrimitives count: 3.
d3d11.c:5785: Test failed: Got unexpected HSInvocations count: 4.
d3d11.c:5786: Test failed: Got unexpected DSInvocations count: 4.
d3d11.c:5787: Test failed: Got unexpected CSInvocations count: 311040.
d3d11.c:5799: Test failed: Got unexpected CPrimitives count: 3.
d3d11.c:5801: Test failed: Got unexpected HSInvocations count: 4.
d3d11.c:5802: Test failed: Got unexpected DSInvocations count: 4.
d3d11.c:5803: Test failed: Got unexpected CSInvocations count: 311040.
d3d11.c:6109: Test succeeded inside todo block: Got unexpected PrimitivesStorageNeeded: 0.
d3d11.c:6119: Test succeeded inside todo block: Got unexpected PrimitivesStorageNeeded: 0.
d3d11.c:8316: Test failed: Test 60: Got unexpected color 0xff0000ff at (0, 0).
d3d11.c:8316: Test failed: Test 60: Got unexpected color 0xff00ffff at (1, 0).
d3d11.c:8316: Test failed: Test 60: Got unexpected color 0xff00ff00 at (2, 0).
d3d11.c:8316: Test failed: Test 60: Got unexpected color 0xffffff00 at (3, 0).
d3d11.c:8316: Test failed: Test 60: Got unexpected color 0xffff0000 at (0, 1).
d3d11.c:8316: Test failed: Test 60: Got unexpected color 0xffff00ff at (1, 1).
d3d11.c:8316: Test failed: Test 60: Got unexpected color 0xff000000 at (2, 1).
d3d11.c:8316: Test failed: Test 60: Got unexpected color 0xff7f7f7f at (3, 1).
d3d11.c:8316: Test failed: Test 60: Got unexpected color 0xffffffff at (0, 2).
d3d11.c:8316: Test failed: Test 60: Got unexpected color 0xffffffff at (1, 2).
d3d11.c:8316: Test failed: Test 60: Got unexpected color 0xffffffff at (2, 2).
d3d11.c:8316: Test failed: Test 60: Got unexpected color 0xff000000 at (3, 2).
d3d11.c:8316: Test failed: Test 60: Got unexpected color 0xffffffff at (0, 3).
d3d11.c:8316: Test failed: Test 60: Got unexpected color 0xff000000 at (2, 3).
d3d11.c:8316: Test failed: Test 60: Got unexpected color 0xff000000 at (3, 3).
d3d11.c:16860: Test failed: Got {-1.00003052e+000, 0.00000000e+000, 1.00000000e+000, 0.00000000e+000}, expected {-1.00000000e+000, 0.00000000e+000, 1.00000000e+000, 0.00000000e+000} at (0, 0), sub-resource 0.
d3d11.c:17958: Test failed: Got {0x00000000, 0x00000000, 0x00000000, 0x00000000}, expected {0x00000000, 0xffffffff, 0x00000000, 0x00000000} at (0, 0), sub-resource 0.
d3d11.c:17958: Test failed: Got {0xffffffff, 0x00000001, 0x00000000, 0x00000000}, expected {0x00000000, 0x00000001, 0x00000000, 0x00000000} at (0, 0), sub-resource 0.
d3d11.c:17958: Test failed: Got {0x00000001, 0xffffffff, 0x00000000, 0x00000000}, expected {0x00000001, 0x00000000, 0x00000000, 0x00000000} at (0, 0), sub-resource 0.
d3d11.c:16860: Test failed: Got {-1.00787401e+000, 0.00000000e+000, 1.00000000e+000, 5.03937006e-001}, expected {-1.00000000e+000, 0.00000000e+000, 1.00000000e+000, 5.03937006e-001} at (0, 0), sub-resource 0.
d3d11.c:27602: Test failed: Resource type 1, test 7: pixel (200, 200) has color 00000000, expected ffff0000.
d3d11.c:27602: Test failed: Resource type 1, test 7: pixel (280, 200) has color 00000000, expected ffff0000.
d3d11.c:27602: Test failed: Resource type 1, test 7: pixel (360, 200) has color 00000000, expected ff00ff00.
d3d11.c:27602: Test failed: Resource type 1, test 7: pixel (440, 200) has color 00000000, expected ff00ff00.
d3d11.c:27602: Test failed: Resource type 1, test 7: pixel (200, 270) has color 00000000, expected ff0000ff.
d3d11.c:27602: Test failed: Resource type 1, test 7: pixel (280, 270) has color 00000000, expected ff0000ff.
d3d11.c:27602: Test failed: Resource type 1, test 7: pixel (360, 270) has color 00000000, expected ff000000.
d3d11.c:27602: Test failed: Resource type 1, test 7: pixel (440, 270) has color 00000000, expected ff000000.
d3d11.c:27602: Test failed: Resource type 1, test 8: pixel (200, 200) has color 00000000, expected ffff0000.
d3d11.c:27602: Test failed: Resource type 1, test 8: pixel (280, 200) has color 00000000, expected ffff0000.
d3d11.c:27602: Test failed: Resource type 1, test 8: pixel (360, 200) has color 00000000, expected ff00ff00.
d3d11.c:27602: Test failed: Resource type 1, test 8: pixel (440, 200) has color 00000000, expected ff00ff00.
d3d11.c:27602: Test failed: Resource type 1, test 8: pixel (200, 270) has color 00000000, expected ff0000ff.
d3d11.c:27602: Test failed: Resource type 1, test 8: pixel (280, 270) has color 00000000, expected ff0000ff.
d3d11.c:27602: Test failed: Resource type 1, test 8: pixel (360, 270) has color 00000000, expected ff000000.
d3d11.c:27602: Test failed: Resource type 1, test 8: pixel (440, 270) has color 00000000, expected ff000000.
d3d11.c:27602: Test failed: Resource type 2, test 7: pixel (200, 200) has color 00000000, expected ffff0000.
d3d11.c:27602: Test failed: Resource type 2, test 7: pixel (280, 200) has color 00000000, expected ffff0000.
d3d11.c:27602: Test failed: Resource type 2, test 7: pixel (360, 200) has color 00000000, expected ff00ff00.
d3d11.c:27602: Test failed: Resource type 2, test 7: pixel (440, 200) has color 00000000, expected ff00ff00.
d3d11.c:27602: Test failed: Resource type 2, test 7: pixel (200, 270) has color 00000000, expected ff0000ff.
d3d11.c:27602: Test failed: Resource type 2, test 7: pixel (280, 270) has color 00000000, expected ff0000ff.
d3d11.c:27602: Test failed: Resource type 2, test 7: pixel (360, 270) has color 00000000, expected ff000000.
d3d11.c:27602: Test failed: Resource type 2, test 7: pixel (440, 270) has color 00000000, expected ff000000.
d3d11.c:27602: Test failed: Resource type 2, test 8: pixel (200, 200) has color 00000000, expected ffff0000.
d3d11.c:27602: Test failed: Resource type 2, test 8: pixel (280, 200) has color 00000000, expected ffff0000.
d3d11.c:27602: Test failed: Resource type 2, test 8: pixel (360, 200) has color 00000000, expected ff00ff00.
d3d11.c:27602: Test failed: Resource type 2, test 8: pixel (440, 200) has color 00000000, expected ff00ff00.
d3d11.c:27602: Test failed: Resource type 2, test 8: pixel (200, 270) has color 00000000, expected ff0000ff.
d3d11.c:27602: Test failed: Resource type 2, test 8: pixel (280, 270) has color 00000000, expected ff0000ff.
d3d11.c:27602: Test failed: Resource type 2, test 8: pixel (360, 270) has color 00000000, expected ff000000.
d3d11.c:27602: Test failed: Resource type 2, test 8: pixel (440, 270) has color 00000000, expected ff000000.
d3d11.c:27602: Test failed: Resource type 3, test 7: pixel (200, 200) has color 00000000, expected ffff0000.
d3d11.c:27602: Test failed: Resource type 3, test 7: pixel (280, 200) has color 00000000, expected ffff0000.
d3d11.c:27602: Test failed: Resource type 3, test 7: pixel (360, 200) has color 00000000, expected ff00ff00.
d3d11.c:27602: Test failed: Resource type 3, test 7: pixel (440, 200) has color 00000000, expected ff00ff00.
d3d11.c:27602: Test failed: Resource type 3, test 7: pixel (200, 270) has color 00000000, expected ff0000ff.
d3d11.c:27602: Test failed: Resource type 3, test 7: pixel (280, 270) has color 00000000, expected ff0000ff.
d3d11.c:27602: Test failed: Resource type 3, test 7: pixel (360, 270) has color 00000000, expected ff000000.
d3d11.c:27602: Test failed: Resource type 3, test 7: pixel (440, 270) has color 00000000, expected ff000000.
d3d11.c:27602: Test failed: Resource type 3, test 8: pixel (200, 200) has color 00000000, expected ffff0000.
d3d11.c:27602: Test failed: Resource type 3, test 8: pixel (280, 200) has color 00000000, expected ffff0000.
d3d11.c:27602: Test failed: Resource type 3, test 8: pixel (360, 200) has color 00000000, expected ff00ff00.
d3d11.c:27602: Test failed: Resource type 3, test 8: pixel (440, 200) has color 00000000, expected ff00ff00.
d3d11.c:27602: Test failed: Resource type 3, test 8: pixel (200, 270) has color 00000000, expected ff0000ff.
d3d11.c:27602: Test failed: Resource type 3, test 8: pixel (280, 270) has color 00000000, expected ff0000ff.
d3d11.c:27602: Test failed: Resource type 3, test 8: pixel (360, 270) has color 00000000, expected ff000000.
d3d11.c:27602: Test failed: Resource type 3, test 8: pixel (440, 270) has color 00000000, expected ff000000.
d3d11.c:25838: Test failed: Got depth 2.51951814e-003, expected 2.51948950e-003.
d3d11.c:25838: Test failed: Got depth 2.51951814e-003, expected 2.51948950e-003.
d3d11.c:25838: Test failed: Got depth 1.27950311e-003, expected 1.27948953e-003.
d3d11.c:25838: Test failed: Got depth 1.27950311e-003, expected 1.27948953e-003.
d3d11.c:25838: Test failed: Got depth 1.27950311e-003, expected 1.27948953e-003.
d3d11.c:25838: Test failed: Got depth 1.27950311e-003, expected 1.27948953e-003.
d3d11.c:25838: Test failed: Got depth 1.27950311e-003, expected 1.27948953e-003.
d3d11.c:25838: Test failed: Got depth 1.27950311e-003, expected 1.27948953e-003.
d3d11.c:25838: Test failed: Got depth 5.03277779e-003, expected 5.03897900e-003.
d3d11.c:25838: Test failed: Got depth 5.03277779e-003, expected 5.03897900e-003.
d3d11.c:25838: Test failed: Got depth 2.54905224e-003, expected 2.54897905e-003.
d3d11.c:25838: Test failed: Got depth 7.52645731e-003, expected 7.53897894e-003.
d3d11.c:25838: Test failed: Got depth 7.52645731e-003, expected 7.53897894e-003.
d3d11.c:25838: Test failed: Got depth 2.54905224e-003, expected 2.54897905e-003.
d3d11.c:25838: Test failed: Got depth 1.25139356e-002, expected 1.25389788e-002.
d3d11.c:25838: Test failed: Got depth 1.25139356e-002, expected 1.25389788e-002.
d3d11.c:25838: Test failed: Got depth 2.54905224e-003, expected 2.54897905e-003.
d3d11.c:25838: Test failed: Got depth 6.40938997e-001, expected 6.42538965e-001.
d3d11.c:25838: Test failed: Got depth 6.40938997e-001, expected 6.42538965e-001.
d3d11.c:25838: Test failed: Got depth 2.54905224e-003, expected 2.54897905e-003.
d3d11.c:25838: Test failed: Got depth 2.54905224e-003, expected 2.54897905e-003.
d3d11.c:25838: Test failed: Got depth 2.54905224e-003, expected 2.54897905e-003.
d3d11.c:25846: Test failed: Got value 0x149d4 (5.03277809e-003), expected 0x14a3c (5.03897697e-003).
d3d11.c:25846: Test failed: Got value 0x149d4 (5.03277809e-003), expected 0x14a3c (5.03897697e-003).
d3d11.c:25846: Test failed: Got value 0x5c5c2 (2.25487961e-002), expected 0x5c5c6 (2.25490345e-002).
d3d11.c:25846: Test failed: Got value 0x1ed41 (7.52645776e-003), expected 0x1ee13 (7.53897473e-003).
d3d11.c:25846: Test failed: Got value 0x1ed41 (7.52645776e-003), expected 0x1ee13 (7.53897473e-003).
d3d11.c:25846: Test failed: Got value 0x5c5c2 (2.25487961e-002), expected 0x5c5c6 (2.25490345e-002).
d3d11.c:25846: Test failed: Got value 0x3341d (1.25139363e-002), expected 0x335c1 (1.25389703e-002).
d3d11.c:25846: Test failed: Got value 0x3341d (1.25139363e-002), expected 0x335c1 (1.25389703e-002).
d3d11.c:25846: Test failed: Got value 0x5c5c2 (2.25487961e-002), expected 0x5c5c6 (2.25490345e-002).
d3d11.c:25846: Test failed: Got value 0xa41493 (6.40938976e-001), expected 0xa47d6e (6.42538943e-001).
d3d11.c:25846: Test failed: Got value 0xa41493 (6.40938976e-001), expected 0xa47d6e (6.42538943e-001).
d3d11.c:25846: Test failed: Got value 0x5c5c2 (2.25487961e-002), expected 0x5c5c6 (2.25490345e-002).
d3d11.c:25846: Test failed: Got value 0x5c5c2 (2.25487961e-002), expected 0x5c5c6 (2.25490345e-002).
d3d11.c:25846: Test failed: Got value 0x5c5c2 (2.25487961e-002), expected 0x5c5c6 (2.25490345e-002).
d3d11.c:25855: Test failed: Got value 0x3d8 (1.50148775e-002), expected 0x3da (1.50453956e-002).
d3d11.c:25855: Test failed: Got value 0x3d8 (1.50148775e-002), expected 0x3da (1.50453956e-002).
d3d11.c:25855: Test failed: Got value 0x333 (1.24971389e-002), expected 0x336 (1.25429160e-002).
d3d11.c:25855: Test failed: Got value 0x333 (1.24971389e-002), expected 0x336 (1.25429160e-002).
d3d11.c:25855: Test failed: Got value 0x479 (1.74715801e-002), expected 0x47d (1.75326162e-002).
d3d11.c:25855: Test failed: Got value 0x479 (1.74715801e-002), expected 0x47d (1.75326162e-002).
d3d11.c:25855: Test failed: Got value 0xa414 (6.40939956e-001), expected 0xa47c (6.42526894e-001).
d3d11.c:25855: Test failed: Got value 0xa414 (6.40939956e-001), expected 0xa47c (6.42526894e-001).
d3d8
device.c:3165: Test failed: Expected message 0x1c for window 0x1, but didn't receive it
visual.c:6623: Test failed: Expected color 0x00000000, got 0x000000ff, format D3DFMT_Q8W8V8U8, test 0, location 3x2.
visual.c:6623: Test failed: Expected color 0x00000000, got 0x000000ff, format D3DFMT_Q8W8V8U8, test 2, location 3x2.
visual.c:7464: Test failed: Got unexpected color 0x0000ff00 (case 0, 3, size 0).
visual.c:7464: Test failed: Got unexpected color 0x0000ff00 (case 1, 3, size 0).
visual.c:7464: Test failed: Got unexpected color 0x0000ff00 (case 2, 3, size 0).
visual.c:7464: Test failed: Got unexpected color 0x0000ff00 (case 3, 3, size 0).
visual.c:7464: Test failed: Got unexpected color 0x0000ff00 (case 4, 7, size 0).
visual.c:7464: Test failed: Got unexpected color 0x0000ff00 (case 5, 7, size 0).
visual.c:8791: Test failed: Test 0 shading has color1 000000ff, expected 0000ff00.
visual.c:8791: Test failed: Test 6 shading has color1 000000ff, expected 0000ff00.
visual.c:8791: Test failed: Test 10 shading has color1 000000ff, expected 0000ff00.
visual.c:8791: Test failed: Test 11 shading has color1 000000ff, expected 0000ff00.
visual.c:10297: Test failed: Expected unsynchronised map for flags 0x1000.
visual.c:10297: Test failed: Expected unsynchronised map for flags 0x3000.
d3d9
d3d9ex.c:3133: Test failed: Expected message 0x46 for window 0x1, but didn't receive it, i=0.
device.c:4624: Test failed: Received unexpected WM_SIZE message.
device.c:6094: Test failed: Got unexpected hr 0x1.
device.c:6098: Test failed: Got unexpected hr 0x1.
device.c:6099: Test failed: Got unexpected query result 0xffffffffffffffff.
device: Timeout
visual.c:9410: Test failed: Test 0 shading has color1 000000ff, expected 0000ff00.
visual.c:9410: Test failed: Test 6 shading has color1 000000ff, expected 0000ff00.
visual.c:9410: Test failed: Test 10 shading has color1 000000ff, expected 0000ff00.
visual.c:9410: Test failed: Test 11 shading has color1 000000ff, expected 0000ff00.
visual.c:9410: Test failed: Test 12 shading has color1 000000ff, expected 0000ff00.
visual.c:11972: Test failed: Got unexpected color 0x0000ff00 (case 0, 3, size 0).
visual.c:11972: Test failed: Got unexpected color 0x0000ff00 (case 1, 3, size 0).
visual.c:11972: Test failed: Got unexpected color 0x0000ff00 (case 2, 3, size 0).
visual.c:11972: Test failed: Got unexpected color 0x0000ff00 (case 3, 3, size 0).
visual.c:11972: Test failed: Got unexpected color 0x0000ff00 (case 4, 3, size 0).
visual.c:11972: Test failed: Got unexpected color 0x00ff0000 (case 5, 3, size 0).
visual.c:11972: Test failed: Got unexpected color 0x0000ff00 (case 6, 3, size 0).
visual.c:11972: Test failed: Got unexpected color 0x00ff0000 (case 7, 3, size 0).
visual.c:11972: Test failed: Got unexpected color 0x0000ff00 (case 8, 3, size 0).
visual.c:11972: Test failed: Got unexpected color 0x00ff0000 (case 9, 3, size 0).
visual.c:11972: Test failed: Got unexpected color 0x0000ff00 (case 10, 7, size 0).
visual.c:11972: Test failed: Got unexpected color 0x0000ff00 (case 11, 7, size 0).
visual.c:11972: Test failed: Got unexpected color 0x0000ff00 (case 12, 7, size 0).
visual.c:20801: Test failed: Expected color 0x00000000, got 0x000000ff, format D3DFMT_Q8W8V8U8, test 0, location 3x2.
visual.c:20801: Test failed: Expected color 0x00000000, got 0x000000ff, format D3DFMT_Q8W8V8U8, test 2, location 3x2.
visual.c:22064: Test failed: Got unexpected color 00ffffff at x=64, format 80.
visual.c:22071: Test failed: Got unexpected color 000000ff at x=194, format 80.
visual.c:22081: Test failed: Got unexpected color 00000000 at x=446, format 80.
visual.c:22064: Test failed: Got unexpected color 00ffffff at x=64, format 77.
visual.c:22071: Test failed: Got unexpected color 000000ff at x=194, format 77.
visual.c:22081: Test failed: Got unexpected color 00000000 at x=446, format 77.
visual.c:22064: Test failed: Got unexpected color 00ffffff at x=64, format 75.
visual.c:22071: Test failed: Got unexpected color 000000ff at x=194, format 75.
visual.c:22081: Test failed: Got unexpected color 00000000 at x=446, format 75.
visual.c:22064: Test failed: Got unexpected color 00ffffff at x=64, format 1515474505.
visual.c:22071: Test failed: Got unexpected color 000000ff at x=194, format 1515474505.
visual.c:22081: Test failed: Got unexpected color 00000000 at x=446, format 1515474505.
visual.c:25211: Test failed: Expected unsynchronised map for flags 0x1000.
visual.c:25211: Test failed: Expected unsynchronised map for flags 0x3000.
ddraw
ddraw2.c:9700: Test failed: Test 0 shading has color1 000000ff, expected 0000ff00.
ddraw4.c:11476: Test failed: Test 0 shading has color1 000000ff, expected 0000ff00.
ddraw7.c:11485: Test failed: Test 0 shading has color1 000000ff, expected 0000ff00.
ddraw7.c:14422: Test failed: Expected unsynchronised map for flags 0x1000.
ddraw7.c:14422: Test failed: Expected unsynchronised map for flags 0x3000.
dinput
dinput.c:405: Test failed: guidProduct.Data2 is 7734
dinput.c:407: Test failed: guidProduct.Data3 is 11d2
dinput.c:409: Test failed: guidProduct.Data4 does not match: {9e573ed9-7734-11d2-8d4a-23903fb6bdf7}
dinput.c:405: Test failed: guidProduct.Data2 is 7734
dinput.c:407: Test failed: guidProduct.Data3 is 11d2
dinput.c:409: Test failed: guidProduct.Data4 does not match: {9e573ed9-7734-11d2-8d4a-23903fb6bdf7}
joystick.c:405: Test failed: IDirectInput_GetProperty() for DIPROP_GUIDANDPATH failed: 80004001
joystick.c:416: Test failed: DIPROP_GUIDANDPATH path has wrong format. Expected count: 2 Got: -1 Path: L""
joystick.c:418: Test failed: DIPROP_GUIDANDPATH path should contain either 'ig_' or 'mi_' substring. Path: L""
joystick.c:405: Test failed: IDirectInput_GetProperty() for DIPROP_GUIDANDPATH failed: 80004001
joystick.c:416: Test failed: DIPROP_GUIDANDPATH path has wrong format. Expected count: 2 Got: -1 Path: L""
joystick.c:418: Test failed: DIPROP_GUIDANDPATH path should contain either 'ig_' or 'mi_' substring. Path: L""
joystick.c:405: Test failed: IDirectInput_GetProperty() for DIPROP_GUIDANDPATH failed: 80004001
joystick.c:416: Test failed: DIPROP_GUIDANDPATH path has wrong format. Expected count: 2 Got: -1 Path: L""
joystick.c:418: Test failed: DIPROP_GUIDANDPATH path should contain either 'ig_' or 'mi_' substring. Path: L""
mouse.c:152: Test failed: Failed: 00000001
mouse.c:158: Test failed: Failed: 80070005
mouse.c:161: Test failed: Failed: 00000001
mouse.c:164: Test failed: Failed: 80070005
mouse.c:178: Test failed: GetDeviceData() failed: 00000000 cnt:0
dxgi
dxgi.c:2116: Test failed: Failed to get containing output, hr 0x887a0002.
Unhandled exception: page fault on execute access to 0x04455355 in 32-bit code (0x04455355).
gdi32
driver.c:81: Test failed: Got unexpected return code 0xc0000001.
driver.c:93: Test failed: Got unexpected value 0.
driver.c:97: Test failed: Got unexpected return code 0xc000000d.
kernel32
Unhandled exception: page fault on write access to 0x00000000 in 32-bit code (0x00439de2).
mmdevapi
render.c:1349: Test failed: Activation failed with 8889000a
render.c:1880: Test failed: Activation failed with 8889000a
mstask
task_scheduler.c:498: Test failed: got 0x80070020
task_scheduler.c:295: Test failed: got 0x80070020
ole32
clipboard.c:1049: Test failed: OleIsCurrentClipboard returned 0
clipboard.c:1117: Test failed: 1 WM_DRAWCLIPBOARD received
rsaenh
rsaenh.c:2391: Test failed: 8009000d
services.exe
service.c:422: Test failed: service: Unexpected monitor rcMonitor values: {1024,0,2048,739}
service.c:422: Test failed: service: Unexpected monitor rcWork values: {1024,0,2048,739}
service.c:422: Test failed: service: Unexpected szDevice received: \\.\DISPLAY2
service.c:422: Test failed: service: Unexpected secondary monitor info.
service.c:422: Test failed: service: Callback got called less or more than once. 2
urlmon
protocol.c:3656: Test failed: wait timed out
protocol: Timeout
url: Timeout
user32
msg.c:5148: Test succeeded inside todo block: ShowWindow(SW_SHOWMINIMIZED):overlapped: marked "todo_wine" but succeeds
sysparams.c:3251: Test failed: 0: wrong virt desktop rect (0,0)-(2048,768) expected (0,0)-(1024,768)
sysparams.c:3265: Test failed: 0: wrong caps virt desktop rect (0,0)-(2048,768) expected (0,0)-(1024,768)
sysparams.c:3251: Test failed: 1: wrong virt desktop rect (0,0)-(2048,768) expected (0,0)-(1024,768)
sysparams.c:3265: Test failed: 1: wrong caps virt desktop rect (0,0)-(2048,768) expected (0,0)-(1024,768)
sysparams.c:3251: Test failed: 2: wrong virt desktop rect (0,0)-(2048,768) expected (0,0)-(1024,768)
sysparams.c:3265: Test failed: 2: wrong caps virt desktop rect (0,0)-(2048,768) expected (0,0)-(1024,768)
sysparams.c:3343: Test failed: 0/0: wrong desktop resolution (0,0)-(2048,768) expected (0,0)-(1024,768)
sysparams.c:3343: Test failed: 0/1: wrong desktop resolution (0,0)-(2048,768) expected (0,0)-(1024,768)
sysparams.c:3343: Test failed: 0/2: wrong desktop resolution (0,0)-(2048,768) expected (0,0)-(1024,768)
sysparams.c:3343: Test failed: 1/0: wrong desktop resolution (0,0)-(2048,768) expected (0,0)-(1024,768)
sysparams.c:3343: Test failed: 1/1: wrong desktop resolution (0,0)-(2048,768) expected (0,0)-(1024,768)
sysparams.c:3343: Test failed: 1/2: wrong desktop resolution (0,0)-(2048,768) expected (0,0)-(1024,768)
sysparams.c:3343: Test failed: 2/0: wrong desktop resolution (0,0)-(2048,768) expected (0,0)-(1024,768)
sysparams.c:3343: Test failed: 2/1: wrong desktop resolution (0,0)-(2048,768) expected (0,0)-(1024,768)
sysparams.c:3343: Test failed: 2/2: wrong desktop resolution (0,0)-(2048,768) expected (0,0)-(1024,768)
wininet
ftp: Timeout
http.c:6174: Test failed: req_error = 12045
http.c:6213: Test failed: Unexpected cert errors 12045, skipping security flags tests
ws2_32
sock.c:3052: Test failed: Test[1]: expected 2, got 0
sock.c:3052: Test failed: Test[2]: expected 2, got 0
sock.c:3052: Test failed: Test[1]: expected 2, got 0
sock.c:3052: Test failed: Test[2]: expected 2, got 0
Report errors
d3d11:d3d11 prints too much data (35751 bytes)
dxgi:dxgi crashed (c0000005)
kernel32:virtual prints too much data (91050 bytes)
opengl32:opengl has no test summary line (early exit of the main process?)
opengl32:opengl has unaccounted for todo messages
opengl32:opengl has unaccounted for skip messages
user32:msg prints too much data (35218 bytes)
vulkan-1:vulkan had no start line (or it is garbled)
Task log
X Error of failed request:  BadValue (integer parameter out of range for operation)
  Major opcode of failed request:  53 (X_CreatePixmap)

debian10 (32 bit Japanese:Japan tests)

Debian 10 / vm4Debian 10 configured for Wine. Runs fvwm with 2 screens. [CPU:4*host RAM:3GB disk:virtio-scsi eth:virtio snd:ich9 GPU:qxl display:spice testagentd:1.7]
Missions: win32,lang=ja_JP
32 bit Japanese:Japan report
d3d10core
d3d10core.c:4773: Test failed: Got unexpected CPrimitives count: 3.
d3d10core.c:4970: Test succeeded inside todo block: Got unexpected PrimitivesStorageNeeded: 0.
d3d10core.c:4980: Test succeeded inside todo block: Got unexpected PrimitivesStorageNeeded: 0.
d3d10core.c:4787: Test failed: Got unexpected CPrimitives count: 3.
d3d10core.c:7479: Test failed: Test 52: Got unexpected color 0xff0000ff at (0, 0).
d3d10core.c:7479: Test failed: Test 52: Got unexpected color 0xff00ffff at (1, 0).
d3d10core.c:7479: Test failed: Test 52: Got unexpected color 0xff00ff00 at (2, 0).
d3d10core.c:7479: Test failed: Test 52: Got unexpected color 0xffffff00 at (3, 0).
d3d10core.c:7479: Test failed: Test 52: Got unexpected color 0xffff0000 at (0, 1).
d3d10core.c:7479: Test failed: Test 52: Got unexpected color 0xffff00ff at (1, 1).
d3d10core.c:7479: Test failed: Test 52: Got unexpected color 0xff000000 at (2, 1).
d3d10core.c:7479: Test failed: Test 52: Got unexpected color 0xff7f7f7f at (3, 1).
d3d10core.c:7479: Test failed: Test 52: Got unexpected color 0xffffffff at (0, 2).
d3d10core.c:7479: Test failed: Test 52: Got unexpected color 0xffffffff at (1, 2).
d3d10core.c:7479: Test failed: Test 52: Got unexpected color 0xffffffff at (2, 2).
d3d10core.c:7479: Test failed: Test 52: Got unexpected color 0xff000000 at (3, 2).
d3d10core.c:7479: Test failed: Test 52: Got unexpected color 0xffffffff at (0, 3).
d3d10core.c:7479: Test failed: Test 52: Got unexpected color 0xff000000 at (2, 3).
d3d10core.c:7479: Test failed: Test 52: Got unexpected color 0xff000000 at (3, 3).
d3d10core.c:12598: Test failed: Got {-1.00003052e+000, 0.00000000e+000, 1.00000000e+000, 0.00000000e+000}, expected {-1.00000000e+000, 0.00000000e+000, 1.00000000e+000, 0.00000000e+000} at (0, 0), sub-resource 0.
d3d10core.c:12958: Test failed: Got {0x00000000, 0x00000000, 0x00000000, 0x00000000}, expected {0x00000000, 0xffffffff, 0x00000000, 0x00000000} at (0, 0), sub-resource 0.
d3d10core.c:12598: Test failed: Got {-1.00787401e+000, 0.00000000e+000, 1.00000000e+000, 5.03937006e-001}, expected {-1.00000000e+000, 0.00000000e+000, 1.00000000e+000, 5.03937006e-001} at (0, 0), sub-resource 0.
d3d10core.c:12958: Test failed: Got {0x00000000, 0x00000000, 0x00000000, 0x00000000}, expected {0xffffffff, 0x00000000, 0x00000000, 0x00000000} at (0, 0), sub-resource 0.
d3d10core.c:12958: Test failed: Got {0xffffffff, 0x00000001, 0x00000000, 0x00000000}, expected {0x00000000, 0x00000001, 0x00000000, 0x00000000} at (0, 0), sub-resource 0.
d3d10core.c:12958: Test failed: Got {0x00000001, 0xffffffff, 0x00000000, 0x00000000}, expected {0x00000001, 0x00000000, 0x00000000, 0x00000000} at (0, 0), sub-resource 0.
d3d10core.c:16920: Test failed: Resource type 1, test 7: pixel (200, 200) has color 00000000, expected ffff0000.
d3d10core.c:16920: Test failed: Resource type 1, test 7: pixel (280, 200) has color 00000000, expected ffff0000.
d3d10core.c:16920: Test failed: Resource type 1, test 7: pixel (360, 200) has color 00000000, expected ff00ff00.
d3d10core.c:16920: Test failed: Resource type 1, test 7: pixel (440, 200) has color 00000000, expected ff00ff00.
d3d10core.c:16920: Test failed: Resource type 1, test 7: pixel (200, 270) has color 00000000, expected ff0000ff.
d3d10core.c:16920: Test failed: Resource type 1, test 7: pixel (280, 270) has color 00000000, expected ff0000ff.
d3d10core.c:16920: Test failed: Resource type 1, test 7: pixel (360, 270) has color 00000000, expected ff000000.
d3d10core.c:16920: Test failed: Resource type 1, test 7: pixel (440, 270) has color 00000000, expected ff000000.
d3d10core.c:16920: Test failed: Resource type 1, test 8: pixel (200, 200) has color 00000000, expected ffff0000.
d3d10core.c:16920: Test failed: Resource type 1, test 8: pixel (280, 200) has color 00000000, expected ffff0000.
d3d10core.c:16920: Test failed: Resource type 1, test 8: pixel (360, 200) has color 00000000, expected ff00ff00.
d3d10core.c:16920: Test failed: Resource type 1, test 8: pixel (440, 200) has color 00000000, expected ff00ff00.
d3d10core.c:16920: Test failed: Resource type 1, test 8: pixel (200, 270) has color 00000000, expected ff0000ff.
d3d10core.c:16920: Test failed: Resource type 1, test 8: pixel (280, 270) has color 00000000, expected ff0000ff.
d3d10core.c:16920: Test failed: Resource type 1, test 8: pixel (360, 270) has color 00000000, expected ff000000.
d3d10core.c:16920: Test failed: Resource type 1, test 8: pixel (440, 270) has color 00000000, expected ff000000.
d3d10core.c:16920: Test failed: Resource type 2, test 7: pixel (200, 200) has color 00000000, expected ffff0000.
d3d10core.c:16920: Test failed: Resource type 2, test 7: pixel (280, 200) has color 00000000, expected ffff0000.
d3d10core.c:16920: Test failed: Resource type 2, test 7: pixel (360, 200) has color 00000000, expected ff00ff00.
d3d10core.c:16920: Test failed: Resource type 2, test 7: pixel (440, 200) has color 00000000, expected ff00ff00.
d3d10core.c:16920: Test failed: Resource type 2, test 7: pixel (200, 270) has color 00000000, expected ff0000ff.
d3d10core.c:16920: Test failed: Resource type 2, test 7: pixel (280, 270) has color 00000000, expected ff0000ff.
d3d10core.c:16920: Test failed: Resource type 2, test 7: pixel (360, 270) has color 00000000, expected ff000000.
d3d10core.c:16920: Test failed: Resource type 2, test 7: pixel (440, 270) has color 00000000, expected ff000000.
d3d10core.c:16920: Test failed: Resource type 2, test 8: pixel (200, 200) has color 00000000, expected ffff0000.
d3d10core.c:16920: Test failed: Resource type 2, test 8: pixel (280, 200) has color 00000000, expected ffff0000.
d3d10core.c:16920: Test failed: Resource type 2, test 8: pixel (360, 200) has color 00000000, expected ff00ff00.
d3d10core.c:16920: Test failed: Resource type 2, test 8: pixel (440, 200) has color 00000000, expected ff00ff00.
d3d10core.c:16920: Test failed: Resource type 2, test 8: pixel (200, 270) has color 00000000, expected ff0000ff.
d3d10core.c:16920: Test failed: Resource type 2, test 8: pixel (280, 270) has color 00000000, expected ff0000ff.
d3d10core.c:16920: Test failed: Resource type 2, test 8: pixel (360, 270) has color 00000000, expected ff000000.
d3d10core.c:16920: Test failed: Resource type 2, test 8: pixel (440, 270) has color 00000000, expected ff000000.
d3d10core.c:16920: Test failed: Resource type 3, test 7: pixel (200, 200) has color 00000000, expected ffff0000.
d3d10core.c:16920: Test failed: Resource type 3, test 7: pixel (280, 200) has color 00000000, expected ffff0000.
d3d10core.c:16920: Test failed: Resource type 3, test 7: pixel (360, 200) has color 00000000, expected ff00ff00.
d3d10core.c:16920: Test failed: Resource type 3, test 7: pixel (440, 200) has color 00000000, expected ff00ff00.
d3d10core.c:16920: Test failed: Resource type 3, test 7: pixel (200, 270) has color 00000000, expected ff0000ff.
d3d10core.c:16920: Test failed: Resource type 3, test 7: pixel (280, 270) has color 00000000, expected ff0000ff.
d3d10core.c:16920: Test failed: Resource type 3, test 7: pixel (360, 270) has color 00000000, expected ff000000.
d3d10core.c:16920: Test failed: Resource type 3, test 7: pixel (440, 270) has color 00000000, expected ff000000.
d3d10core.c:16920: Test failed: Resource type 3, test 8: pixel (200, 200) has color 00000000, expected ffff0000.
d3d10core.c:16920: Test failed: Resource type 3, test 8: pixel (280, 200) has color 00000000, expected ffff0000.
d3d10core.c:16920: Test failed: Resource type 3, test 8: pixel (360, 200) has color 00000000, expected ff00ff00.
d3d10core.c:16920: Test failed: Resource type 3, test 8: pixel (440, 200) has color 00000000, expected ff00ff00.
d3d10core.c:16920: Test failed: Resource type 3, test 8: pixel (200, 270) has color 00000000, expected ff0000ff.
d3d10core.c:16920: Test failed: Resource type 3, test 8: pixel (280, 270) has color 00000000, expected ff0000ff.
d3d10core.c:16920: Test failed: Resource type 3, test 8: pixel (360, 270) has color 00000000, expected ff000000.
d3d10core.c:16920: Test failed: Resource type 3, test 8: pixel (440, 270) has color 00000000, expected ff000000.
d3d10core.c:15852: Test failed: Got depth 2.51951814e-003, expected 2.51948950e-003.
d3d10core.c:15852: Test failed: Got depth 2.51951814e-003, expected 2.51948950e-003.
d3d10core.c:15852: Test failed: Got depth 1.27950311e-003, expected 1.27948953e-003.
d3d10core.c:15852: Test failed: Got depth 1.27950311e-003, expected 1.27948953e-003.
d3d10core.c:15852: Test failed: Got depth 1.27950311e-003, expected 1.27948953e-003.
d3d10core.c:15852: Test failed: Got depth 1.27950311e-003, expected 1.27948953e-003.
d3d10core.c:15852: Test failed: Got depth 1.27950311e-003, expected 1.27948953e-003.
d3d10core.c:15852: Test failed: Got depth 1.27950311e-003, expected 1.27948953e-003.
d3d10core.c:15852: Test failed: Got depth 5.03277779e-003, expected 5.03897900e-003.
d3d10core.c:15852: Test failed: Got depth 5.03277779e-003, expected 5.03897900e-003.
d3d10core.c:15852: Test failed: Got depth 2.54905224e-003, expected 2.54897905e-003.
d3d10core.c:15852: Test failed: Got depth 7.52645731e-003, expected 7.53897894e-003.
d3d10core.c:15852: Test failed: Got depth 7.52645731e-003, expected 7.53897894e-003.
d3d10core.c:15852: Test failed: Got depth 2.54905224e-003, expected 2.54897905e-003.
d3d10core.c:15852: Test failed: Got depth 1.25139356e-002, expected 1.25389788e-002.
d3d10core.c:15852: Test failed: Got depth 1.25139356e-002, expected 1.25389788e-002.
d3d10core.c:15852: Test failed: Got depth 2.54905224e-003, expected 2.54897905e-003.
d3d10core.c:15852: Test failed: Got depth 6.40938997e-001, expected 6.42538965e-001.
d3d10core.c:15852: Test failed: Got depth 6.40938997e-001, expected 6.42538965e-001.
d3d10core.c:15852: Test failed: Got depth 2.54905224e-003, expected 2.54897905e-003.
d3d10core.c:15852: Test failed: Got depth 2.54905224e-003, expected 2.54897905e-003.
d3d10core.c:15852: Test failed: Got depth 2.54905224e-003, expected 2.54897905e-003.
d3d10core.c:15860: Test failed: Got value 0x149d4 (5.03277809e-003), expected 0x14a3c (5.03897697e-003).
d3d10core.c:15860: Test failed: Got value 0x149d4 (5.03277809e-003), expected 0x14a3c (5.03897697e-003).
d3d10core.c:15860: Test failed: Got value 0x5c5c2 (2.25487961e-002), expected 0x5c5c6 (2.25490345e-002).
d3d10core.c:15860: Test failed: Got value 0x1ed41 (7.52645776e-003), expected 0x1ee13 (7.53897473e-003).
d3d10core.c:15860: Test failed: Got value 0x1ed41 (7.52645776e-003), expected 0x1ee13 (7.53897473e-003).
d3d10core.c:15860: Test failed: Got value 0x5c5c2 (2.25487961e-002), expected 0x5c5c6 (2.25490345e-002).
d3d10core.c:15860: Test failed: Got value 0x3341d (1.25139363e-002), expected 0x335c1 (1.25389703e-002).
d3d10core.c:15860: Test failed: Got value 0x3341d (1.25139363e-002), expected 0x335c1 (1.25389703e-002).
d3d10core.c:15860: Test failed: Got value 0x5c5c2 (2.25487961e-002), expected 0x5c5c6 (2.25490345e-002).
d3d10core.c:15860: Test failed: Got value 0xa41493 (6.40938976e-001), expected 0xa47d6e (6.42538943e-001).
d3d10core.c:15860: Test failed: Got value 0xa41493 (6.40938976e-001), expected 0xa47d6e (6.42538943e-001).
d3d10core.c:15860: Test failed: Got value 0x5c5c2 (2.25487961e-002), expected 0x5c5c6 (2.25490345e-002).
d3d10core.c:15860: Test failed: Got value 0x5c5c2 (2.25487961e-002), expected 0x5c5c6 (2.25490345e-002).
d3d10core.c:15860: Test failed: Got value 0x5c5c2 (2.25487961e-002), expected 0x5c5c6 (2.25490345e-002).
d3d10core.c:15869: Test failed: Got value 0x3d8 (1.50148775e-002), expected 0x3da (1.50453956e-002).
d3d10core.c:15869: Test failed: Got value 0x3d8 (1.50148775e-002), expected 0x3da (1.50453956e-002).
d3d10core.c:15869: Test failed: Got value 0x333 (1.24971389e-002), expected 0x336 (1.25429160e-002).
d3d10core.c:15869: Test failed: Got value 0x333 (1.24971389e-002), expected 0x336 (1.25429160e-002).
d3d10core.c:15869: Test failed: Got value 0x479 (1.74715801e-002), expected 0x47d (1.75326162e-002).
d3d10core.c:15869: Test failed: Got value 0x479 (1.74715801e-002), expected 0x47d (1.75326162e-002).
d3d10core.c:15869: Test failed: Got value 0xa414 (6.40939956e-001), expected 0xa47c (6.42526894e-001).
d3d10core.c:15869: Test failed: Got value 0xa414 (6.40939956e-001), expected 0xa47c (6.42526894e-001).
d3d11
d3d11.c:5782: Test failed: Got unexpected CPrimitives count: 3.
d3d11.c:5785: Test failed: Got unexpected HSInvocations count: 4.
d3d11.c:5786: Test failed: Got unexpected DSInvocations count: 4.
d3d11.c:5787: Test failed: Got unexpected CSInvocations count: 311040.
d3d11.c:5799: Test failed: Got unexpected CPrimitives count: 3.
d3d11.c:5801: Test failed: Got unexpected HSInvocations count: 4.
d3d11.c:5802: Test failed: Got unexpected DSInvocations count: 4.
d3d11.c:5803: Test failed: Got unexpected CSInvocations count: 311040.
d3d11.c:6109: Test succeeded inside todo block: Got unexpected PrimitivesStorageNeeded: 0.
d3d11.c:6119: Test succeeded inside todo block: Got unexpected PrimitivesStorageNeeded: 0.
d3d11.c:8316: Test failed: Test 60: Got unexpected color 0xff0000ff at (0, 0).
d3d11.c:8316: Test failed: Test 60: Got unexpected color 0xff00ffff at (1, 0).
d3d11.c:8316: Test failed: Test 60: Got unexpected color 0xff00ff00 at (2, 0).
d3d11.c:8316: Test failed: Test 60: Got unexpected color 0xffffff00 at (3, 0).
d3d11.c:8316: Test failed: Test 60: Got unexpected color 0xffff0000 at (0, 1).
d3d11.c:8316: Test failed: Test 60: Got unexpected color 0xffff00ff at (1, 1).
d3d11.c:8316: Test failed: Test 60: Got unexpected color 0xff000000 at (2, 1).
d3d11.c:8316: Test failed: Test 60: Got unexpected color 0xff7f7f7f at (3, 1).
d3d11.c:8316: Test failed: Test 60: Got unexpected color 0xffffffff at (0, 2).
d3d11.c:8316: Test failed: Test 60: Got unexpected color 0xffffffff at (1, 2).
d3d11.c:8316: Test failed: Test 60: Got unexpected color 0xffffffff at (2, 2).
d3d11.c:8316: Test failed: Test 60: Got unexpected color 0xff000000 at (3, 2).
d3d11.c:8316: Test failed: Test 60: Got unexpected color 0xffffffff at (0, 3).
d3d11.c:8316: Test failed: Test 60: Got unexpected color 0xff000000 at (2, 3).
d3d11.c:8316: Test failed: Test 60: Got unexpected color 0xff000000 at (3, 3).
d3d11.c:16860: Test failed: Got {-1.00003052e+000, 0.00000000e+000, 1.00000000e+000, 0.00000000e+000}, expected {-1.00000000e+000, 0.00000000e+000, 1.00000000e+000, 0.00000000e+000} at (0, 0), sub-resource 0.
d3d11.c:17958: Test failed: Got {0x00000000, 0x00000000, 0x00000000, 0x00000000}, expected {0x00000000, 0xffffffff, 0x00000000, 0x00000000} at (0, 0), sub-resource 0.
d3d11.c:17958: Test failed: Got {0x00000000, 0x00000000, 0x00000000, 0x00000000}, expected {0xffffffff, 0x00000000, 0x00000000, 0x00000000} at (0, 0), sub-resource 0.
d3d11.c:17958: Test failed: Got {0xffffffff, 0x00000001, 0x00000000, 0x00000000}, expected {0x00000000, 0x00000001, 0x00000000, 0x00000000} at (0, 0), sub-resource 0.
d3d11.c:17958: Test failed: Got {0x00000001, 0xffffffff, 0x00000000, 0x00000000}, expected {0x00000001, 0x00000000, 0x00000000, 0x00000000} at (0, 0), sub-resource 0.
d3d11.c:16860: Test failed: Got {-1.00787401e+000, 0.00000000e+000, 1.00000000e+000, 5.03937006e-001}, expected {-1.00000000e+000, 0.00000000e+000, 1.00000000e+000, 5.03937006e-001} at (0, 0), sub-resource 0.
d3d11.c:27602: Test failed: Resource type 1, test 7: pixel (200, 200) has color 00000000, expected ffff0000.
d3d11.c:27602: Test failed: Resource type 1, test 7: pixel (280, 200) has color 00000000, expected ffff0000.
d3d11.c:27602: Test failed: Resource type 1, test 7: pixel (360, 200) has color 00000000, expected ff00ff00.
d3d11.c:27602: Test failed: Resource type 1, test 7: pixel (440, 200) has color 00000000, expected ff00ff00.
d3d11.c:27602: Test failed: Resource type 1, test 7: pixel (200, 270) has color 00000000, expected ff0000ff.
d3d11.c:27602: Test failed: Resource type 1, test 7: pixel (280, 270) has color 00000000, expected ff0000ff.
d3d11.c:27602: Test failed: Resource type 1, test 7: pixel (360, 270) has color 00000000, expected ff000000.
d3d11.c:27602: Test failed: Resource type 1, test 7: pixel (440, 270) has color 00000000, expected ff000000.
d3d11.c:27602: Test failed: Resource type 1, test 8: pixel (200, 200) has color 00000000, expected ffff0000.
d3d11.c:27602: Test failed: Resource type 1, test 8: pixel (280, 200) has color 00000000, expected ffff0000.
d3d11.c:27602: Test failed: Resource type 1, test 8: pixel (360, 200) has color 00000000, expected ff00ff00.
d3d11.c:27602: Test failed: Resource type 1, test 8: pixel (440, 200) has color 00000000, expected ff00ff00.
d3d11.c:27602: Test failed: Resource type 1, test 8: pixel (200, 270) has color 00000000, expected ff0000ff.
d3d11.c:27602: Test failed: Resource type 1, test 8: pixel (280, 270) has color 00000000, expected ff0000ff.
d3d11.c:27602: Test failed: Resource type 1, test 8: pixel (360, 270) has color 00000000, expected ff000000.
d3d11.c:27602: Test failed: Resource type 1, test 8: pixel (440, 270) has color 00000000, expected ff000000.
d3d11.c:27602: Test failed: Resource type 2, test 7: pixel (200, 200) has color 00000000, expected ffff0000.
d3d11.c:27602: Test failed: Resource type 2, test 7: pixel (280, 200) has color 00000000, expected ffff0000.
d3d11.c:27602: Test failed: Resource type 2, test 7: pixel (360, 200) has color 00000000, expected ff00ff00.
d3d11.c:27602: Test failed: Resource type 2, test 7: pixel (440, 200) has color 00000000, expected ff00ff00.
d3d11.c:27602: Test failed: Resource type 2, test 7: pixel (200, 270) has color 00000000, expected ff0000ff.
d3d11.c:27602: Test failed: Resource type 2, test 7: pixel (280, 270) has color 00000000, expected ff0000ff.
d3d11.c:27602: Test failed: Resource type 2, test 7: pixel (360, 270) has color 00000000, expected ff000000.
d3d11.c:27602: Test failed: Resource type 2, test 7: pixel (440, 270) has color 00000000, expected ff000000.
d3d11.c:27602: Test failed: Resource type 2, test 8: pixel (200, 200) has color 00000000, expected ffff0000.
d3d11.c:27602: Test failed: Resource type 2, test 8: pixel (280, 200) has color 00000000, expected ffff0000.
d3d11.c:27602: Test failed: Resource type 2, test 8: pixel (360, 200) has color 00000000, expected ff00ff00.
d3d11.c:27602: Test failed: Resource type 2, test 8: pixel (440, 200) has color 00000000, expected ff00ff00.
d3d11.c:27602: Test failed: Resource type 2, test 8: pixel (200, 270) has color 00000000, expected ff0000ff.
d3d11.c:27602: Test failed: Resource type 2, test 8: pixel (280, 270) has color 00000000, expected ff0000ff.
d3d11.c:27602: Test failed: Resource type 2, test 8: pixel (360, 270) has color 00000000, expected ff000000.
d3d11.c:27602: Test failed: Resource type 2, test 8: pixel (440, 270) has color 00000000, expected ff000000.
d3d11.c:27602: Test failed: Resource type 3, test 7: pixel (200, 200) has color 00000000, expected ffff0000.
d3d11.c:27602: Test failed: Resource type 3, test 7: pixel (280, 200) has color 00000000, expected ffff0000.
d3d11.c:27602: Test failed: Resource type 3, test 7: pixel (360, 200) has color 00000000, expected ff00ff00.
d3d11.c:27602: Test failed: Resource type 3, test 7: pixel (440, 200) has color 00000000, expected ff00ff00.
d3d11.c:27602: Test failed: Resource type 3, test 7: pixel (200, 270) has color 00000000, expected ff0000ff.
d3d11.c:27602: Test failed: Resource type 3, test 7: pixel (280, 270) has color 00000000, expected ff0000ff.
d3d11.c:27602: Test failed: Resource type 3, test 7: pixel (360, 270) has color 00000000, expected ff000000.
d3d11.c:27602: Test failed: Resource type 3, test 7: pixel (440, 270) has color 00000000, expected ff000000.
d3d11.c:27602: Test failed: Resource type 3, test 8: pixel (200, 200) has color 00000000, expected ffff0000.
d3d11.c:27602: Test failed: Resource type 3, test 8: pixel (280, 200) has color 00000000, expected ffff0000.
d3d11.c:27602: Test failed: Resource type 3, test 8: pixel (360, 200) has color 00000000, expected ff00ff00.
d3d11.c:27602: Test failed: Resource type 3, test 8: pixel (440, 200) has color 00000000, expected ff00ff00.
d3d11.c:27602: Test failed: Resource type 3, test 8: pixel (200, 270) has color 00000000, expected ff0000ff.
d3d11.c:27602: Test failed: Resource type 3, test 8: pixel (280, 270) has color 00000000, expected ff0000ff.
d3d11.c:27602: Test failed: Resource type 3, test 8: pixel (360, 270) has color 00000000, expected ff000000.
d3d11.c:27602: Test failed: Resource type 3, test 8: pixel (440, 270) has color 00000000, expected ff000000.
d3d11.c:25838: Test failed: Got depth 2.51951814e-003, expected 2.51948950e-003.
d3d11.c:25838: Test failed: Got depth 2.51951814e-003, expected 2.51948950e-003.
d3d11.c:25838: Test failed: Got depth 1.27950311e-003, expected 1.27948953e-003.
d3d11.c:25838: Test failed: Got depth 1.27950311e-003, expected 1.27948953e-003.
d3d11.c:25838: Test failed: Got depth 1.27950311e-003, expected 1.27948953e-003.
d3d11.c:25838: Test failed: Got depth 1.27950311e-003, expected 1.27948953e-003.
d3d11.c:25838: Test failed: Got depth 1.27950311e-003, expected 1.27948953e-003.
d3d11.c:25838: Test failed: Got depth 1.27950311e-003, expected 1.27948953e-003.
d3d11.c:25838: Test failed: Got depth 5.03277779e-003, expected 5.03897900e-003.
d3d11.c:25838: Test failed: Got depth 5.03277779e-003, expected 5.03897900e-003.
d3d11.c:25838: Test failed: Got depth 2.54905224e-003, expected 2.54897905e-003.
d3d11.c:25838: Test failed: Got depth 7.52645731e-003, expected 7.53897894e-003.
d3d11.c:25838: Test failed: Got depth 7.52645731e-003, expected 7.53897894e-003.
d3d11.c:25838: Test failed: Got depth 2.54905224e-003, expected 2.54897905e-003.
d3d11.c:25838: Test failed: Got depth 1.25139356e-002, expected 1.25389788e-002.
d3d11.c:25838: Test failed: Got depth 1.25139356e-002, expected 1.25389788e-002.
d3d11.c:25838: Test failed: Got depth 2.54905224e-003, expected 2.54897905e-003.
d3d11.c:25838: Test failed: Got depth 6.40938997e-001, expected 6.42538965e-001.
d3d11.c:25838: Test failed: Got depth 6.40938997e-001, expected 6.42538965e-001.
d3d11.c:25838: Test failed: Got depth 2.54905224e-003, expected 2.54897905e-003.
d3d11.c:25838: Test failed: Got depth 2.54905224e-003, expected 2.54897905e-003.
d3d11.c:25838: Test failed: Got depth 2.54905224e-003, expected 2.54897905e-003.
d3d11.c:25846: Test failed: Got value 0x149d4 (5.03277809e-003), expected 0x14a3c (5.03897697e-003).
d3d11.c:25846: Test failed: Got value 0x149d4 (5.03277809e-003), expected 0x14a3c (5.03897697e-003).
d3d11.c:25846: Test failed: Got value 0x5c5c2 (2.25487961e-002), expected 0x5c5c6 (2.25490345e-002).
d3d11.c:25846: Test failed: Got value 0x1ed41 (7.52645776e-003), expected 0x1ee13 (7.53897473e-003).
d3d11.c:25846: Test failed: Got value 0x1ed41 (7.52645776e-003), expected 0x1ee13 (7.53897473e-003).
d3d11.c:25846: Test failed: Got value 0x5c5c2 (2.25487961e-002), expected 0x5c5c6 (2.25490345e-002).
d3d11.c:25846: Test failed: Got value 0x3341d (1.25139363e-002), expected 0x335c1 (1.25389703e-002).
d3d11.c:25846: Test failed: Got value 0x3341d (1.25139363e-002), expected 0x335c1 (1.25389703e-002).
d3d11.c:25846: Test failed: Got value 0x5c5c2 (2.25487961e-002), expected 0x5c5c6 (2.25490345e-002).
d3d11.c:25846: Test failed: Got value 0xa41493 (6.40938976e-001), expected 0xa47d6e (6.42538943e-001).
d3d11.c:25846: Test failed: Got value 0xa41493 (6.40938976e-001), expected 0xa47d6e (6.42538943e-001).
d3d11.c:25846: Test failed: Got value 0x5c5c2 (2.25487961e-002), expected 0x5c5c6 (2.25490345e-002).
d3d11.c:25846: Test failed: Got value 0x5c5c2 (2.25487961e-002), expected 0x5c5c6 (2.25490345e-002).
d3d11.c:25846: Test failed: Got value 0x5c5c2 (2.25487961e-002), expected 0x5c5c6 (2.25490345e-002).
d3d11.c:25855: Test failed: Got value 0x3d8 (1.50148775e-002), expected 0x3da (1.50453956e-002).
d3d11.c:25855: Test failed: Got value 0x3d8 (1.50148775e-002), expected 0x3da (1.50453956e-002).
d3d11.c:25855: Test failed: Got value 0x333 (1.24971389e-002), expected 0x336 (1.25429160e-002).
d3d11.c:25855: Test failed: Got value 0x333 (1.24971389e-002), expected 0x336 (1.25429160e-002).
d3d11.c:25855: Test failed: Got value 0x479 (1.74715801e-002), expected 0x47d (1.75326162e-002).
d3d11.c:25855: Test failed: Got value 0x479 (1.74715801e-002), expected 0x47d (1.75326162e-002).
d3d11.c:25855: Test failed: Got value 0xa414 (6.40939956e-001), expected 0xa47c (6.42526894e-001).
d3d11.c:25855: Test failed: Got value 0xa414 (6.40939956e-001), expected 0xa47c (6.42526894e-001).
d3d8
device.c:3165: Test failed: Expected message 0x1c for window 0x1, but didn't receive it
visual.c:6623: Test failed: Expected color 0x00000000, got 0x000000ff, format D3DFMT_Q8W8V8U8, test 0, location 3x2.
visual.c:6623: Test failed: Expected color 0x00000000, got 0x000000ff, format D3DFMT_Q8W8V8U8, test 2, location 3x2.
visual.c:7464: Test failed: Got unexpected color 0x0000ff00 (case 0, 3, size 0).
visual.c:7464: Test failed: Got unexpected color 0x0000ff00 (case 1, 3, size 0).
visual.c:7464: Test failed: Got unexpected color 0x0000ff00 (case 2, 3, size 0).
visual.c:7464: Test failed: Got unexpected color 0x0000ff00 (case 3, 3, size 0).
visual.c:7464: Test failed: Got unexpected color 0x0000ff00 (case 4, 7, size 0).
visual.c:7464: Test failed: Got unexpected color 0x0000ff00 (case 5, 7, size 0).
visual.c:8791: Test failed: Test 0 shading has color1 000000ff, expected 0000ff00.
visual.c:8791: Test failed: Test 6 shading has color1 000000ff, expected 0000ff00.
visual.c:8791: Test failed: Test 10 shading has color1 000000ff, expected 0000ff00.
visual.c:8791: Test failed: Test 11 shading has color1 000000ff, expected 0000ff00.
visual.c:10297: Test failed: Expected unsynchronised map for flags 0x1000.
visual.c:10297: Test failed: Expected unsynchronised map for flags 0x3000.
d3d9
d3d9ex.c:3133: Test failed: Expected message 0x46 for window 0x1, but didn't receive it, i=0.
device.c:4624: Test failed: Received unexpected WM_SIZE message.
device.c:6094: Test failed: Got unexpected hr 0x1.
device.c:6098: Test failed: Got unexpected hr 0x1.
device.c:6099: Test failed: Got unexpected query result 0xffffffffffffffff.
device: Timeout
visual.c:9410: Test failed: Test 0 shading has color1 000000ff, expected 0000ff00.
visual.c:9410: Test failed: Test 6 shading has color1 000000ff, expected 0000ff00.
visual.c:9410: Test failed: Test 10 shading has color1 000000ff, expected 0000ff00.
visual.c:9410: Test failed: Test 11 shading has color1 000000ff, expected 0000ff00.
visual.c:9410: Test failed: Test 12 shading has color1 000000ff, expected 0000ff00.
visual.c:11972: Test failed: Got unexpected color 0x0000ff00 (case 0, 3, size 0).
visual.c:11972: Test failed: Got unexpected color 0x0000ff00 (case 1, 3, size 0).
visual.c:11972: Test failed: Got unexpected color 0x0000ff00 (case 2, 3, size 0).
visual.c:11972: Test failed: Got unexpected color 0x0000ff00 (case 3, 3, size 0).
visual.c:11972: Test failed: Got unexpected color 0x0000ff00 (case 4, 3, size 0).
visual.c:11972: Test failed: Got unexpected color 0x00ff0000 (case 5, 3, size 0).
visual.c:11972: Test failed: Got unexpected color 0x0000ff00 (case 6, 3, size 0).
visual.c:11972: Test failed: Got unexpected color 0x00ff0000 (case 7, 3, size 0).
visual.c:11972: Test failed: Got unexpected color 0x0000ff00 (case 8, 3, size 0).
visual.c:11972: Test failed: Got unexpected color 0x00ff0000 (case 9, 3, size 0).
visual.c:11972: Test failed: Got unexpected color 0x0000ff00 (case 10, 7, size 0).
visual.c:11972: Test failed: Got unexpected color 0x0000ff00 (case 11, 7, size 0).
visual.c:11972: Test failed: Got unexpected color 0x0000ff00 (case 12, 7, size 0).
visual.c:20801: Test failed: Expected color 0x00000000, got 0x000000ff, format D3DFMT_Q8W8V8U8, test 0, location 3x2.
visual.c:20801: Test failed: Expected color 0x00000000, got 0x000000ff, format D3DFMT_Q8W8V8U8, test 2, location 3x2.
visual.c:22064: Test failed: Got unexpected color 00ffffff at x=64, format 80.
visual.c:22071: Test failed: Got unexpected color 000000ff at x=194, format 80.
visual.c:22081: Test failed: Got unexpected color 00000000 at x=446, format 80.
visual.c:22064: Test failed: Got unexpected color 00ffffff at x=64, format 77.
visual.c:22071: Test failed: Got unexpected color 000000ff at x=194, format 77.
visual.c:22081: Test failed: Got unexpected color 00000000 at x=446, format 77.
visual.c:22064: Test failed: Got unexpected color 00ffffff at x=64, format 75.
visual.c:22071: Test failed: Got unexpected color 000000ff at x=194, format 75.
visual.c:22081: Test failed: Got unexpected color 00000000 at x=446, format 75.
visual.c:22064: Test failed: Got unexpected color 00ffffff at x=64, format 1515474505.
visual.c:22071: Test failed: Got unexpected color 000000ff at x=194, format 1515474505.
visual.c:22081: Test failed: Got unexpected color 00000000 at x=446, format 1515474505.
visual.c:25211: Test failed: Expected unsynchronised map for flags 0x1000.
visual.c:25211: Test failed: Expected unsynchronised map for flags 0x3000.
ddraw
ddraw2.c:9700: Test failed: Test 0 shading has color1 000000ff, expected 0000ff00.
ddraw4.c:11476: Test failed: Test 0 shading has color1 000000ff, expected 0000ff00.
ddraw7.c:11485: Test failed: Test 0 shading has color1 000000ff, expected 0000ff00.
ddraw7.c:14422: Test failed: Expected unsynchronised map for flags 0x1000.
ddraw7.c:14422: Test failed: Expected unsynchronised map for flags 0x3000.
dinput
dinput.c:405: Test failed: guidProduct.Data2 is 7734
dinput.c:407: Test failed: guidProduct.Data3 is 11d2
dinput.c:409: Test failed: guidProduct.Data4 does not match: {9e573ed9-7734-11d2-8d4a-23903fb6bdf7}
dinput.c:405: Test failed: guidProduct.Data2 is 7734
dinput.c:407: Test failed: guidProduct.Data3 is 11d2
dinput.c:409: Test failed: guidProduct.Data4 does not match: {9e573ed9-7734-11d2-8d4a-23903fb6bdf7}
joystick.c:405: Test failed: IDirectInput_GetProperty() for DIPROP_GUIDANDPATH failed: 80004001
joystick.c:416: Test failed: DIPROP_GUIDANDPATH path has wrong format. Expected count: 2 Got: -1 Path: L""
joystick.c:418: Test failed: DIPROP_GUIDANDPATH path should contain either 'ig_' or 'mi_' substring. Path: L""
joystick.c:405: Test failed: IDirectInput_GetProperty() for DIPROP_GUIDANDPATH failed: 80004001
joystick.c:416: Test failed: DIPROP_GUIDANDPATH path has wrong format. Expected count: 2 Got: -1 Path: L""
joystick.c:418: Test failed: DIPROP_GUIDANDPATH path should contain either 'ig_' or 'mi_' substring. Path: L""
joystick.c:405: Test failed: IDirectInput_GetProperty() for DIPROP_GUIDANDPATH failed: 80004001
joystick.c:416: Test failed: DIPROP_GUIDANDPATH path has wrong format. Expected count: 2 Got: -1 Path: L""
joystick.c:418: Test failed: DIPROP_GUIDANDPATH path should contain either 'ig_' or 'mi_' substring. Path: L""
mouse.c:152: Test failed: Failed: 00000001
mouse.c:158: Test failed: Failed: 80070005
mouse.c:161: Test failed: Failed: 00000001
mouse.c:164: Test failed: Failed: 80070005
mouse.c:178: Test failed: GetDeviceData() failed: 00000000 cnt:0
dxgi
dxgi.c:2116: Test failed: Failed to get containing output, hr 0x887a0002.
Unhandled exception: page fault on execute access to 0x00455355 in 32-bit code (0x00455355).
gdi32
driver.c:81: Test failed: Got unexpected return code 0xc0000001.
driver.c:93: Test failed: Got unexpected value 0.
driver.c:97: Test failed: Got unexpected return code 0xc000000d.
font.c:6304: Test failed: expected vertical face for charset 128, got Droid Sans Fallback
font.c:6304: Test failed: expected vertical face for charset 129, got Droid Sans Fallback
font.c:6304: Test failed: expected vertical face for charset 130, got Droid Sans Fallback
font.c:6304: Test failed: expected vertical face for charset 134, got Droid Sans Fallback
font.c:6304: Test failed: expected vertical face for charset 136, got Droid Sans Fallback
ieframe
ie: Timeout
kernel32
comm.c:919: Test failed: OutQueue should not be empty
Unhandled exception: page fault on write access to 0x00000000 in 32-bit code (0x00439de2).
mmdevapi
render.c:1349: Test failed: Activation failed with 8889000a
render.c:1880: Test failed: Activation failed with 8889000a
mshtml
htmldoc: Timeout
ole32
clipboard.c:1049: Test failed: OleIsCurrentClipboard returned 0
clipboard.c:1117: Test failed: 1 WM_DRAWCLIPBOARD received
rsaenh
rsaenh.c:2391: Test failed: 8009000d
services.exe
service.c:422: Test failed: service: Unexpected monitor rcMonitor values: {1024,0,2048,739}
service.c:422: Test failed: service: Unexpected monitor rcWork values: {1024,0,2048,739}
service.c:422: Test failed: service: Unexpected szDevice received: \\.\DISPLAY2
service.c:422: Test failed: service: Unexpected secondary monitor info.
service.c:422: Test failed: service: Callback got called less or more than once. 2
urlmon
protocol.c:3656: Test failed: wait timed out
protocol: Timeout
url: Timeout
user32
msg.c:5148: Test succeeded inside todo block: ShowWindow(SW_SHOWMINIMIZED):overlapped: marked "todo_wine" but succeeds
sysparams.c:3251: Test failed: 0: wrong virt desktop rect (0,0)-(2048,768) expected (0,0)-(1024,768)
sysparams.c:3265: Test failed: 0: wrong caps virt desktop rect (0,0)-(2048,768) expected (0,0)-(1024,768)
sysparams.c:3251: Test failed: 1: wrong virt desktop rect (0,0)-(2048,768) expected (0,0)-(1024,768)
sysparams.c:3265: Test failed: 1: wrong caps virt desktop rect (0,0)-(2048,768) expected (0,0)-(1024,768)
sysparams.c:3251: Test failed: 2: wrong virt desktop rect (0,0)-(2048,768) expected (0,0)-(1024,768)
sysparams.c:3265: Test failed: 2: wrong caps virt desktop rect (0,0)-(2048,768) expected (0,0)-(1024,768)
sysparams.c:3343: Test failed: 0/0: wrong desktop resolution (0,0)-(2048,768) expected (0,0)-(1024,768)
sysparams.c:3343: Test failed: 0/1: wrong desktop resolution (0,0)-(2048,768) expected (0,0)-(1024,768)
sysparams.c:3343: Test failed: 0/2: wrong desktop resolution (0,0)-(2048,768) expected (0,0)-(1024,768)
sysparams.c:3343: Test failed: 1/0: wrong desktop resolution (0,0)-(2048,768) expected (0,0)-(1024,768)
sysparams.c:3343: Test failed: 1/1: wrong desktop resolution (0,0)-(2048,768) expected (0,0)-(1024,768)
sysparams.c:3343: Test failed: 1/2: wrong desktop resolution (0,0)-(2048,768) expected (0,0)-(1024,768)
sysparams.c:3343: Test failed: 2/0: wrong desktop resolution (0,0)-(2048,768) expected (0,0)-(1024,768)
sysparams.c:3343: Test failed: 2/1: wrong desktop resolution (0,0)-(2048,768) expected (0,0)-(1024,768)
sysparams.c:3343: Test failed: 2/2: wrong desktop resolution (0,0)-(2048,768) expected (0,0)-(1024,768)
wininet
ftp.c:81: Test failed: Expected ERROR_INTERNET_LOGIN_FAILURE, got 12110
ftp.c:112: Test failed: InternetConnect failed : 12110
ftp.c:113: Test failed: ERROR_SUCCESS, got 12110
ftp.c:122: Test failed: Expected ERROR_INTERNET_LOGIN_FAILURE, got 12110
ftp: Timeout
http.c:6174: Test failed: req_error = 12045
http.c:6213: Test failed: Unexpected cert errors 12045, skipping security flags tests
http.c:4777: Test failed: expected 1 pending read, got 2
winmm
mci: Timeout
Report errors
d3d11:d3d11 prints too much data (35751 bytes)
dxgi:dxgi crashed (c0000005)
kernel32:virtual prints too much data (91050 bytes)
opengl32:opengl has no test summary line (early exit of the main process?)
opengl32:opengl has unaccounted for todo messages
opengl32:opengl has unaccounted for skip messages
user32:msg prints too much data (35220 bytes)
vulkan-1:vulkan had no start line (or it is garbled)
Task log
X Error of failed request:  BadValue (integer parameter out of range for operation)
  Major opcode of failed request:  53 (X_CreatePixmap)
Task errors
The task timed out
The previous 1 run(s) terminated abnormally

debian10 (32 bit Chinese:China tests)

Debian 10 / vm4Debian 10 configured for Wine. Runs fvwm with 2 screens. [CPU:4*host RAM:3GB disk:virtio-scsi eth:virtio snd:ich9 GPU:qxl display:spice testagentd:1.7]
Missions: win32,test=module,lang=zh_CN
32 bit Chinese:China report
d3d10core
d3d10core.c:4773: Test failed: Got unexpected CPrimitives count: 3.
d3d10core.c:4787: Test failed: Got unexpected CPrimitives count: 3.
d3d10core.c:4970: Test succeeded inside todo block: Got unexpected PrimitivesStorageNeeded: 0.
d3d10core.c:4980: Test succeeded inside todo block: Got unexpected PrimitivesStorageNeeded: 0.
d3d10core.c:7479: Test failed: Test 52: Got unexpected color 0xff0000ff at (0, 0).
d3d10core.c:7479: Test failed: Test 52: Got unexpected color 0xff00ffff at (1, 0).
d3d10core.c:7479: Test failed: Test 52: Got unexpected color 0xff00ff00 at (2, 0).
d3d10core.c:7479: Test failed: Test 52: Got unexpected color 0xffffff00 at (3, 0).
d3d10core.c:7479: Test failed: Test 52: Got unexpected color 0xffff0000 at (0, 1).
d3d10core.c:7479: Test failed: Test 52: Got unexpected color 0xffff00ff at (1, 1).
d3d10core.c:7479: Test failed: Test 52: Got unexpected color 0xff000000 at (2, 1).
d3d10core.c:7479: Test failed: Test 52: Got unexpected color 0xff7f7f7f at (3, 1).
d3d10core.c:7479: Test failed: Test 52: Got unexpected color 0xffffffff at (0, 2).
d3d10core.c:7479: Test failed: Test 52: Got unexpected color 0xffffffff at (1, 2).
d3d10core.c:7479: Test failed: Test 52: Got unexpected color 0xffffffff at (2, 2).
d3d10core.c:7479: Test failed: Test 52: Got unexpected color 0xff000000 at (3, 2).
d3d10core.c:7479: Test failed: Test 52: Got unexpected color 0xffffffff at (0, 3).
d3d10core.c:7479: Test failed: Test 52: Got unexpected color 0xff000000 at (2, 3).
d3d10core.c:7479: Test failed: Test 52: Got unexpected color 0xff000000 at (3, 3).
d3d10core.c:12598: Test failed: Got {-1.00003052e+000, 0.00000000e+000, 1.00000000e+000, 0.00000000e+000}, expected {-1.00000000e+000, 0.00000000e+000, 1.00000000e+000, 0.00000000e+000} at (0, 0), sub-resource 0.
d3d10core.c:12958: Test failed: Got {0x00000000, 0x00000000, 0x00000000, 0x00000000}, expected {0x00000000, 0xffffffff, 0x00000000, 0x00000000} at (0, 0), sub-resource 0.
d3d10core.c:12958: Test failed: Got {0x00000000, 0x00000000, 0x00000000, 0x00000000}, expected {0xffffffff, 0x00000000, 0x00000000, 0x00000000} at (0, 0), sub-resource 0.
d3d10core.c:12958: Test failed: Got {0xffffffff, 0x00000001, 0x00000000, 0x00000000}, expected {0x00000000, 0x00000001, 0x00000000, 0x00000000} at (0, 0), sub-resource 0.
d3d10core.c:12958: Test failed: Got {0x00000001, 0xffffffff, 0x00000000, 0x00000000}, expected {0x00000001, 0x00000000, 0x00000000, 0x00000000} at (0, 0), sub-resource 0.
d3d10core.c:12598: Test failed: Got {-1.00787401e+000, 0.00000000e+000, 1.00000000e+000, 5.03937006e-001}, expected {-1.00000000e+000, 0.00000000e+000, 1.00000000e+000, 5.03937006e-001} at (0, 0), sub-resource 0.
d3d10core.c:16920: Test failed: Resource type 1, test 7: pixel (200, 200) has color 00000000, expected ffff0000.
d3d10core.c:16920: Test failed: Resource type 1, test 7: pixel (280, 200) has color 00000000, expected ffff0000.
d3d10core.c:16920: Test failed: Resource type 1, test 7: pixel (360, 200) has color 00000000, expected ff00ff00.
d3d10core.c:16920: Test failed: Resource type 1, test 7: pixel (440, 200) has color 00000000, expected ff00ff00.
d3d10core.c:16920: Test failed: Resource type 1, test 7: pixel (200, 270) has color 00000000, expected ff0000ff.
d3d10core.c:16920: Test failed: Resource type 1, test 7: pixel (280, 270) has color 00000000, expected ff0000ff.
d3d10core.c:16920: Test failed: Resource type 1, test 7: pixel (360, 270) has color 00000000, expected ff000000.
d3d10core.c:16920: Test failed: Resource type 1, test 7: pixel (440, 270) has color 00000000, expected ff000000.
d3d10core.c:16920: Test failed: Resource type 1, test 8: pixel (200, 200) has color 00000000, expected ffff0000.
d3d10core.c:16920: Test failed: Resource type 1, test 8: pixel (280, 200) has color 00000000, expected ffff0000.
d3d10core.c:16920: Test failed: Resource type 1, test 8: pixel (360, 200) has color 00000000, expected ff00ff00.
d3d10core.c:16920: Test failed: Resource type 1, test 8: pixel (440, 200) has color 00000000, expected ff00ff00.
d3d10core.c:16920: Test failed: Resource type 1, test 8: pixel (200, 270) has color 00000000, expected ff0000ff.
d3d10core.c:16920: Test failed: Resource type 1, test 8: pixel (280, 270) has color 00000000, expected ff0000ff.
d3d10core.c:16920: Test failed: Resource type 1, test 8: pixel (360, 270) has color 00000000, expected ff000000.
d3d10core.c:16920: Test failed: Resource type 1, test 8: pixel (440, 270) has color 00000000, expected ff000000.
d3d10core.c:16920: Test failed: Resource type 2, test 7: pixel (200, 200) has color 00000000, expected ffff0000.
d3d10core.c:16920: Test failed: Resource type 2, test 7: pixel (280, 200) has color 00000000, expected ffff0000.
d3d10core.c:16920: Test failed: Resource type 2, test 7: pixel (360, 200) has color 00000000, expected ff00ff00.
d3d10core.c:16920: Test failed: Resource type 2, test 7: pixel (440, 200) has color 00000000, expected ff00ff00.
d3d10core.c:16920: Test failed: Resource type 2, test 7: pixel (200, 270) has color 00000000, expected ff0000ff.
d3d10core.c:16920: Test failed: Resource type 2, test 7: pixel (280, 270) has color 00000000, expected ff0000ff.
d3d10core.c:16920: Test failed: Resource type 2, test 7: pixel (360, 270) has color 00000000, expected ff000000.
d3d10core.c:16920: Test failed: Resource type 2, test 7: pixel (440, 270) has color 00000000, expected ff000000.
d3d10core.c:16920: Test failed: Resource type 2, test 8: pixel (200, 200) has color 00000000, expected ffff0000.
d3d10core.c:16920: Test failed: Resource type 2, test 8: pixel (280, 200) has color 00000000, expected ffff0000.
d3d10core.c:16920: Test failed: Resource type 2, test 8: pixel (360, 200) has color 00000000, expected ff00ff00.
d3d10core.c:16920: Test failed: Resource type 2, test 8: pixel (440, 200) has color 00000000, expected ff00ff00.
d3d10core.c:16920: Test failed: Resource type 2, test 8: pixel (200, 270) has color 00000000, expected ff0000ff.
d3d10core.c:16920: Test failed: Resource type 2, test 8: pixel (280, 270) has color 00000000, expected ff0000ff.
d3d10core.c:16920: Test failed: Resource type 2, test 8: pixel (360, 270) has color 00000000, expected ff000000.
d3d10core.c:16920: Test failed: Resource type 2, test 8: pixel (440, 270) has color 00000000, expected ff000000.
d3d10core.c:16920: Test failed: Resource type 3, test 7: pixel (200, 200) has color 00000000, expected ffff0000.
d3d10core.c:16920: Test failed: Resource type 3, test 7: pixel (280, 200) has color 00000000, expected ffff0000.
d3d10core.c:16920: Test failed: Resource type 3, test 7: pixel (360, 200) has color 00000000, expected ff00ff00.
d3d10core.c:16920: Test failed: Resource type 3, test 7: pixel (440, 200) has color 00000000, expected ff00ff00.
d3d10core.c:16920: Test failed: Resource type 3, test 7: pixel (200, 270) has color 00000000, expected ff0000ff.
d3d10core.c:16920: Test failed: Resource type 3, test 7: pixel (280, 270) has color 00000000, expected ff0000ff.
d3d10core.c:16920: Test failed: Resource type 3, test 7: pixel (360, 270) has color 00000000, expected ff000000.
d3d10core.c:16920: Test failed: Resource type 3, test 7: pixel (440, 270) has color 00000000, expected ff000000.
d3d10core.c:16920: Test failed: Resource type 3, test 8: pixel (200, 200) has color 00000000, expected ffff0000.
d3d10core.c:16920: Test failed: Resource type 3, test 8: pixel (280, 200) has color 00000000, expected ffff0000.
d3d10core.c:16920: Test failed: Resource type 3, test 8: pixel (360, 200) has color 00000000, expected ff00ff00.
d3d10core.c:16920: Test failed: Resource type 3, test 8: pixel (440, 200) has color 00000000, expected ff00ff00.
d3d10core.c:16920: Test failed: Resource type 3, test 8: pixel (200, 270) has color 00000000, expected ff0000ff.
d3d10core.c:16920: Test failed: Resource type 3, test 8: pixel (280, 270) has color 00000000, expected ff0000ff.
d3d10core.c:16920: Test failed: Resource type 3, test 8: pixel (360, 270) has color 00000000, expected ff000000.
d3d10core.c:16920: Test failed: Resource type 3, test 8: pixel (440, 270) has color 00000000, expected ff000000.
d3d10core.c:15852: Test failed: Got depth 2.51951814e-003, expected 2.51948950e-003.
d3d10core.c:15852: Test failed: Got depth 2.51951814e-003, expected 2.51948950e-003.
d3d10core.c:15852: Test failed: Got depth 1.27950311e-003, expected 1.27948953e-003.
d3d10core.c:15852: Test failed: Got depth 1.27950311e-003, expected 1.27948953e-003.
d3d10core.c:15852: Test failed: Got depth 1.27950311e-003, expected 1.27948953e-003.
d3d10core.c:15852: Test failed: Got depth 1.27950311e-003, expected 1.27948953e-003.
d3d10core.c:15852: Test failed: Got depth 1.27950311e-003, expected 1.27948953e-003.
d3d10core.c:15852: Test failed: Got depth 1.27950311e-003, expected 1.27948953e-003.
d3d10core.c:15852: Test failed: Got depth 5.03277779e-003, expected 5.03897900e-003.
d3d10core.c:15852: Test failed: Got depth 5.03277779e-003, expected 5.03897900e-003.
d3d10core.c:15852: Test failed: Got depth 2.54905224e-003, expected 2.54897905e-003.
d3d10core.c:15852: Test failed: Got depth 7.52645731e-003, expected 7.53897894e-003.
d3d10core.c:15852: Test failed: Got depth 7.52645731e-003, expected 7.53897894e-003.
d3d10core.c:15852: Test failed: Got depth 2.54905224e-003, expected 2.54897905e-003.
d3d10core.c:15852: Test failed: Got depth 1.25139356e-002, expected 1.25389788e-002.
d3d10core.c:15852: Test failed: Got depth 1.25139356e-002, expected 1.25389788e-002.
d3d10core.c:15852: Test failed: Got depth 2.54905224e-003, expected 2.54897905e-003.
d3d10core.c:15852: Test failed: Got depth 6.40938997e-001, expected 6.42538965e-001.
d3d10core.c:15852: Test failed: Got depth 6.40938997e-001, expected 6.42538965e-001.
d3d10core.c:15852: Test failed: Got depth 2.54905224e-003, expected 2.54897905e-003.
d3d10core.c:15852: Test failed: Got depth 2.54905224e-003, expected 2.54897905e-003.
d3d10core.c:15852: Test failed: Got depth 2.54905224e-003, expected 2.54897905e-003.
d3d10core.c:15860: Test failed: Got value 0x149d4 (5.03277809e-003), expected 0x14a3c (5.03897697e-003).
d3d10core.c:15860: Test failed: Got value 0x149d4 (5.03277809e-003), expected 0x14a3c (5.03897697e-003).
d3d10core.c:15860: Test failed: Got value 0x5c5c2 (2.25487961e-002), expected 0x5c5c6 (2.25490345e-002).
d3d10core.c:15860: Test failed: Got value 0x1ed41 (7.52645776e-003), expected 0x1ee13 (7.53897473e-003).
d3d10core.c:15860: Test failed: Got value 0x1ed41 (7.52645776e-003), expected 0x1ee13 (7.53897473e-003).
d3d10core.c:15860: Test failed: Got value 0x5c5c2 (2.25487961e-002), expected 0x5c5c6 (2.25490345e-002).
d3d10core.c:15860: Test failed: Got value 0x3341d (1.25139363e-002), expected 0x335c1 (1.25389703e-002).
d3d10core.c:15860: Test failed: Got value 0x3341d (1.25139363e-002), expected 0x335c1 (1.25389703e-002).
d3d10core.c:15860: Test failed: Got value 0x5c5c2 (2.25487961e-002), expected 0x5c5c6 (2.25490345e-002).
d3d10core.c:15860: Test failed: Got value 0xa41493 (6.40938976e-001), expected 0xa47d6e (6.42538943e-001).
d3d10core.c:15860: Test failed: Got value 0xa41493 (6.40938976e-001), expected 0xa47d6e (6.42538943e-001).
d3d10core.c:15860: Test failed: Got value 0x5c5c2 (2.25487961e-002), expected 0x5c5c6 (2.25490345e-002).
d3d10core.c:15860: Test failed: Got value 0x5c5c2 (2.25487961e-002), expected 0x5c5c6 (2.25490345e-002).
d3d10core.c:15860: Test failed: Got value 0x5c5c2 (2.25487961e-002), expected 0x5c5c6 (2.25490345e-002).
d3d10core.c:15869: Test failed: Got value 0x3d8 (1.50148775e-002), expected 0x3da (1.50453956e-002).
d3d10core.c:15869: Test failed: Got value 0x3d8 (1.50148775e-002), expected 0x3da (1.50453956e-002).
d3d10core.c:15869: Test failed: Got value 0x333 (1.24971389e-002), expected 0x336 (1.25429160e-002).
d3d10core.c:15869: Test failed: Got value 0x333 (1.24971389e-002), expected 0x336 (1.25429160e-002).
d3d10core.c:15869: Test failed: Got value 0x479 (1.74715801e-002), expected 0x47d (1.75326162e-002).
d3d10core.c:15869: Test failed: Got value 0x479 (1.74715801e-002), expected 0x47d (1.75326162e-002).
d3d10core.c:15869: Test failed: Got value 0xa414 (6.40939956e-001), expected 0xa47c (6.42526894e-001).
d3d10core.c:15869: Test failed: Got value 0xa414 (6.40939956e-001), expected 0xa47c (6.42526894e-001).
d3d11
d3d11.c:5782: Test failed: Got unexpected CPrimitives count: 3.
d3d11.c:5785: Test failed: Got unexpected HSInvocations count: 4.
d3d11.c:5786: Test failed: Got unexpected DSInvocations count: 4.
d3d11.c:5787: Test failed: Got unexpected CSInvocations count: 311040.
d3d11.c:5799: Test failed: Got unexpected CPrimitives count: 3.
d3d11.c:5801: Test failed: Got unexpected HSInvocations count: 4.
d3d11.c:5802: Test failed: Got unexpected DSInvocations count: 4.
d3d11.c:5803: Test failed: Got unexpected CSInvocations count: 311040.
d3d11.c:6109: Test succeeded inside todo block: Got unexpected PrimitivesStorageNeeded: 0.
d3d11.c:6119: Test succeeded inside todo block: Got unexpected PrimitivesStorageNeeded: 0.
d3d11.c:8316: Test failed: Test 60: Got unexpected color 0xff0000ff at (0, 0).
d3d11.c:8316: Test failed: Test 60: Got unexpected color 0xff00ffff at (1, 0).
d3d11.c:8316: Test failed: Test 60: Got unexpected color 0xff00ff00 at (2, 0).
d3d11.c:8316: Test failed: Test 60: Got unexpected color 0xffffff00 at (3, 0).
d3d11.c:8316: Test failed: Test 60: Got unexpected color 0xffff0000 at (0, 1).
d3d11.c:8316: Test failed: Test 60: Got unexpected color 0xffff00ff at (1, 1).
d3d11.c:8316: Test failed: Test 60: Got unexpected color 0xff000000 at (2, 1).
d3d11.c:8316: Test failed: Test 60: Got unexpected color 0xff7f7f7f at (3, 1).
d3d11.c:8316: Test failed: Test 60: Got unexpected color 0xffffffff at (0, 2).
d3d11.c:8316: Test failed: Test 60: Got unexpected color 0xffffffff at (1, 2).
d3d11.c:8316: Test failed: Test 60: Got unexpected color 0xffffffff at (2, 2).
d3d11.c:8316: Test failed: Test 60: Got unexpected color 0xff000000 at (3, 2).
d3d11.c:8316: Test failed: Test 60: Got unexpected color 0xffffffff at (0, 3).
d3d11.c:8316: Test failed: Test 60: Got unexpected color 0xff000000 at (2, 3).
d3d11.c:8316: Test failed: Test 60: Got unexpected color 0xff000000 at (3, 3).
d3d11.c:16860: Test failed: Got {-1.00003052e+000, 0.00000000e+000, 1.00000000e+000, 0.00000000e+000}, expected {-1.00000000e+000, 0.00000000e+000, 1.00000000e+000, 0.00000000e+000} at (0, 0), sub-resource 0.
d3d11.c:16860: Test failed: Got {-1.00787401e+000, 0.00000000e+000, 1.00000000e+000, 5.03937006e-001}, expected {-1.00000000e+000, 0.00000000e+000, 1.00000000e+000, 5.03937006e-001} at (0, 0), sub-resource 0.
d3d11.c:17958: Test failed: Got {0x00000000, 0x00000000, 0x00000000, 0x00000000}, expected {0x00000000, 0xffffffff, 0x00000000, 0x00000000} at (0, 0), sub-resource 0.
d3d11.c:17958: Test failed: Got {0x00000000, 0x00000000, 0x00000000, 0x00000000}, expected {0xffffffff, 0x00000000, 0x00000000, 0x00000000} at (0, 0), sub-resource 0.
d3d11.c:17958: Test failed: Got {0xffffffff, 0x00000001, 0x00000000, 0x00000000}, expected {0x00000000, 0x00000001, 0x00000000, 0x00000000} at (0, 0), sub-resource 0.
d3d11.c:17958: Test failed: Got {0x00000001, 0xffffffff, 0x00000000, 0x00000000}, expected {0x00000001, 0x00000000, 0x00000000, 0x00000000} at (0, 0), sub-resource 0.
d3d11.c:27602: Test failed: Resource type 1, test 7: pixel (200, 200) has color 00000000, expected ffff0000.
d3d11.c:27602: Test failed: Resource type 1, test 7: pixel (280, 200) has color 00000000, expected ffff0000.
d3d11.c:27602: Test failed: Resource type 1, test 7: pixel (360, 200) has color 00000000, expected ff00ff00.
d3d11.c:27602: Test failed: Resource type 1, test 7: pixel (440, 200) has color 00000000, expected ff00ff00.
d3d11.c:27602: Test failed: Resource type 1, test 7: pixel (200, 270) has color 00000000, expected ff0000ff.
d3d11.c:27602: Test failed: Resource type 1, test 7: pixel (280, 270) has color 00000000, expected ff0000ff.
d3d11.c:27602: Test failed: Resource type 1, test 7: pixel (360, 270) has color 00000000, expected ff000000.
d3d11.c:27602: Test failed: Resource type 1, test 7: pixel (440, 270) has color 00000000, expected ff000000.
d3d11.c:27602: Test failed: Resource type 1, test 8: pixel (200, 200) has color 00000000, expected ffff0000.
d3d11.c:27602: Test failed: Resource type 1, test 8: pixel (280, 200) has color 00000000, expected ffff0000.
d3d11.c:27602: Test failed: Resource type 1, test 8: pixel (360, 200) has color 00000000, expected ff00ff00.
d3d11.c:27602: Test failed: Resource type 1, test 8: pixel (440, 200) has color 00000000, expected ff00ff00.
d3d11.c:27602: Test failed: Resource type 1, test 8: pixel (200, 270) has color 00000000, expected ff0000ff.
d3d11.c:27602: Test failed: Resource type 1, test 8: pixel (280, 270) has color 00000000, expected ff0000ff.
d3d11.c:27602: Test failed: Resource type 1, test 8: pixel (360, 270) has color 00000000, expected ff000000.
d3d11.c:27602: Test failed: Resource type 1, test 8: pixel (440, 270) has color 00000000, expected ff000000.
d3d11.c:27602: Test failed: Resource type 2, test 7: pixel (200, 200) has color 00000000, expected ffff0000.
d3d11.c:27602: Test failed: Resource type 2, test 7: pixel (280, 200) has color 00000000, expected ffff0000.
d3d11.c:27602: Test failed: Resource type 2, test 7: pixel (360, 200) has color 00000000, expected ff00ff00.
d3d11.c:27602: Test failed: Resource type 2, test 7: pixel (440, 200) has color 00000000, expected ff00ff00.
d3d11.c:27602: Test failed: Resource type 2, test 7: pixel (200, 270) has color 00000000, expected ff0000ff.
d3d11.c:27602: Test failed: Resource type 2, test 7: pixel (280, 270) has color 00000000, expected ff0000ff.
d3d11.c:27602: Test failed: Resource type 2, test 7: pixel (360, 270) has color 00000000, expected ff000000.
d3d11.c:27602: Test failed: Resource type 2, test 7: pixel (440, 270) has color 00000000, expected ff000000.
d3d11.c:27602: Test failed: Resource type 2, test 8: pixel (200, 200) has color 00000000, expected ffff0000.
d3d11.c:27602: Test failed: Resource type 2, test 8: pixel (280, 200) has color 00000000, expected ffff0000.
d3d11.c:27602: Test failed: Resource type 2, test 8: pixel (360, 200) has color 00000000, expected ff00ff00.
d3d11.c:27602: Test failed: Resource type 2, test 8: pixel (440, 200) has color 00000000, expected ff00ff00.
d3d11.c:27602: Test failed: Resource type 2, test 8: pixel (200, 270) has color 00000000, expected ff0000ff.
d3d11.c:27602: Test failed: Resource type 2, test 8: pixel (280, 270) has color 00000000, expected ff0000ff.
d3d11.c:27602: Test failed: Resource type 2, test 8: pixel (360, 270) has color 00000000, expected ff000000.
d3d11.c:27602: Test failed: Resource type 2, test 8: pixel (440, 270) has color 00000000, expected ff000000.
d3d11.c:27602: Test failed: Resource type 3, test 7: pixel (200, 200) has color 00000000, expected ffff0000.
d3d11.c:27602: Test failed: Resource type 3, test 7: pixel (280, 200) has color 00000000, expected ffff0000.
d3d11.c:27602: Test failed: Resource type 3, test 7: pixel (360, 200) has color 00000000, expected ff00ff00.
d3d11.c:27602: Test failed: Resource type 3, test 7: pixel (440, 200) has color 00000000, expected ff00ff00.
d3d11.c:27602: Test failed: Resource type 3, test 7: pixel (200, 270) has color 00000000, expected ff0000ff.
d3d11.c:27602: Test failed: Resource type 3, test 7: pixel (280, 270) has color 00000000, expected ff0000ff.
d3d11.c:27602: Test failed: Resource type 3, test 7: pixel (360, 270) has color 00000000, expected ff000000.
d3d11.c:27602: Test failed: Resource type 3, test 7: pixel (440, 270) has color 00000000, expected ff000000.
d3d11.c:27602: Test failed: Resource type 3, test 8: pixel (200, 200) has color 00000000, expected ffff0000.
d3d11.c:27602: Test failed: Resource type 3, test 8: pixel (280, 200) has color 00000000, expected ffff0000.
d3d11.c:27602: Test failed: Resource type 3, test 8: pixel (360, 200) has color 00000000, expected ff00ff00.
d3d11.c:27602: Test failed: Resource type 3, test 8: pixel (440, 200) has color 00000000, expected ff00ff00.
d3d11.c:27602: Test failed: Resource type 3, test 8: pixel (200, 270) has color 00000000, expected ff0000ff.
d3d11.c:27602: Test failed: Resource type 3, test 8: pixel (280, 270) has color 00000000, expected ff0000ff.
d3d11.c:27602: Test failed: Resource type 3, test 8: pixel (360, 270) has color 00000000, expected ff000000.
d3d11.c:27602: Test failed: Resource type 3, test 8: pixel (440, 270) has color 00000000, expected ff000000.
d3d11.c:25838: Test failed: Got depth 2.51951814e-003, expected 2.51948950e-003.
d3d11.c:25838: Test failed: Got depth 2.51951814e-003, expected 2.51948950e-003.
d3d11.c:25838: Test failed: Got depth 1.27950311e-003, expected 1.27948953e-003.
d3d11.c:25838: Test failed: Got depth 1.27950311e-003, expected 1.27948953e-003.
d3d11.c:25838: Test failed: Got depth 1.27950311e-003, expected 1.27948953e-003.
d3d11.c:25838: Test failed: Got depth 1.27950311e-003, expected 1.27948953e-003.
d3d11.c:25838: Test failed: Got depth 1.27950311e-003, expected 1.27948953e-003.
d3d11.c:25838: Test failed: Got depth 1.27950311e-003, expected 1.27948953e-003.
d3d11.c:25838: Test failed: Got depth 5.03277779e-003, expected 5.03897900e-003.
d3d11.c:25838: Test failed: Got depth 5.03277779e-003, expected 5.03897900e-003.
d3d11.c:25838: Test failed: Got depth 2.54905224e-003, expected 2.54897905e-003.
d3d11.c:25838: Test failed: Got depth 7.52645731e-003, expected 7.53897894e-003.
d3d11.c:25838: Test failed: Got depth 7.52645731e-003, expected 7.53897894e-003.
d3d11.c:25838: Test failed: Got depth 2.54905224e-003, expected 2.54897905e-003.
d3d11.c:25838: Test failed: Got depth 1.25139356e-002, expected 1.25389788e-002.
d3d11.c:25838: Test failed: Got depth 1.25139356e-002, expected 1.25389788e-002.
d3d11.c:25838: Test failed: Got depth 2.54905224e-003, expected 2.54897905e-003.
d3d11.c:25838: Test failed: Got depth 6.40938997e-001, expected 6.42538965e-001.
d3d11.c:25838: Test failed: Got depth 6.40938997e-001, expected 6.42538965e-001.
d3d11.c:25838: Test failed: Got depth 2.54905224e-003, expected 2.54897905e-003.
d3d11.c:25838: Test failed: Got depth 2.54905224e-003, expected 2.54897905e-003.
d3d11.c:25838: Test failed: Got depth 2.54905224e-003, expected 2.54897905e-003.
d3d11.c:25846: Test failed: Got value 0x149d4 (5.03277809e-003), expected 0x14a3c (5.03897697e-003).
d3d11.c:25846: Test failed: Got value 0x149d4 (5.03277809e-003), expected 0x14a3c (5.03897697e-003).
d3d11.c:25846: Test failed: Got value 0x5c5c2 (2.25487961e-002), expected 0x5c5c6 (2.25490345e-002).
d3d11.c:25846: Test failed: Got value 0x1ed41 (7.52645776e-003), expected 0x1ee13 (7.53897473e-003).
d3d11.c:25846: Test failed: Got value 0x1ed41 (7.52645776e-003), expected 0x1ee13 (7.53897473e-003).
d3d11.c:25846: Test failed: Got value 0x5c5c2 (2.25487961e-002), expected 0x5c5c6 (2.25490345e-002).
d3d11.c:25846: Test failed: Got value 0x3341d (1.25139363e-002), expected 0x335c1 (1.25389703e-002).
d3d11.c:25846: Test failed: Got value 0x3341d (1.25139363e-002), expected 0x335c1 (1.25389703e-002).
d3d11.c:25846: Test failed: Got value 0x5c5c2 (2.25487961e-002), expected 0x5c5c6 (2.25490345e-002).
d3d11.c:25846: Test failed: Got value 0xa41493 (6.40938976e-001), expected 0xa47d6e (6.42538943e-001).
d3d11.c:25846: Test failed: Got value 0xa41493 (6.40938976e-001), expected 0xa47d6e (6.42538943e-001).
d3d11.c:25846: Test failed: Got value 0x5c5c2 (2.25487961e-002), expected 0x5c5c6 (2.25490345e-002).
d3d11.c:25846: Test failed: Got value 0x5c5c2 (2.25487961e-002), expected 0x5c5c6 (2.25490345e-002).
d3d11.c:25846: Test failed: Got value 0x5c5c2 (2.25487961e-002), expected 0x5c5c6 (2.25490345e-002).
d3d11.c:25855: Test failed: Got value 0x3d8 (1.50148775e-002), expected 0x3da (1.50453956e-002).
d3d11.c:25855: Test failed: Got value 0x3d8 (1.50148775e-002), expected 0x3da (1.50453956e-002).
d3d11.c:25855: Test failed: Got value 0x333 (1.24971389e-002), expected 0x336 (1.25429160e-002).
d3d11.c:25855: Test failed: Got value 0x333 (1.24971389e-002), expected 0x336 (1.25429160e-002).
d3d11.c:25855: Test failed: Got value 0x479 (1.74715801e-002), expected 0x47d (1.75326162e-002).
d3d11.c:25855: Test failed: Got value 0x479 (1.74715801e-002), expected 0x47d (1.75326162e-002).
d3d11.c:25855: Test failed: Got value 0xa414 (6.40939956e-001), expected 0xa47c (6.42526894e-001).
d3d11.c:25855: Test failed: Got value 0xa414 (6.40939956e-001), expected 0xa47c (6.42526894e-001).
d3d8
device.c:3165: Test failed: Expected message 0x1c for window 0x1, but didn't receive it
visual.c:6623: Test failed: Expected color 0x00000000, got 0x000000ff, format D3DFMT_Q8W8V8U8, test 0, location 3x2.
visual.c:6623: Test failed: Expected color 0x00000000, got 0x000000ff, format D3DFMT_Q8W8V8U8, test 2, location 3x2.
visual.c:7464: Test failed: Got unexpected color 0x0000ff00 (case 0, 3, size 0).
visual.c:7464: Test failed: Got unexpected color 0x0000ff00 (case 1, 3, size 0).
visual.c:7464: Test failed: Got unexpected color 0x0000ff00 (case 2, 3, size 0).
visual.c:7464: Test failed: Got unexpected color 0x0000ff00 (case 3, 3, size 0).
visual.c:7464: Test failed: Got unexpected color 0x0000ff00 (case 4, 7, size 0).
visual.c:7464: Test failed: Got unexpected color 0x0000ff00 (case 5, 7, size 0).
visual.c:8791: Test failed: Test 0 shading has color1 000000ff, expected 0000ff00.
visual.c:8791: Test failed: Test 6 shading has color1 000000ff, expected 0000ff00.
visual.c:8791: Test failed: Test 10 shading has color1 000000ff, expected 0000ff00.
visual.c:8791: Test failed: Test 11 shading has color1 000000ff, expected 0000ff00.
visual.c:10297: Test failed: Expected unsynchronised map for flags 0x1000.
visual.c:10297: Test failed: Expected unsynchronised map for flags 0x3000.
d3d9
d3d9ex.c:3133: Test failed: Expected message 0x46 for window 0x1, but didn't receive it, i=0.
device.c:4624: Test failed: Received unexpected WM_SIZE message.
device.c:6094: Test failed: Got unexpected hr 0x1.
device.c:6098: Test failed: Got unexpected hr 0x1.
device.c:6099: Test failed: Got unexpected query result 0xffffffffffffffff.
device: Timeout
visual.c:9410: Test failed: Test 0 shading has color1 000000ff, expected 0000ff00.
visual.c:9410: Test failed: Test 6 shading has color1 000000ff, expected 0000ff00.
visual.c:9410: Test failed: Test 10 shading has color1 000000ff, expected 0000ff00.
visual.c:9410: Test failed: Test 11 shading has color1 000000ff, expected 0000ff00.
visual.c:9410: Test failed: Test 12 shading has color1 000000ff, expected 0000ff00.
visual.c:11972: Test failed: Got unexpected color 0x0000ff00 (case 0, 3, size 0).
visual.c:11972: Test failed: Got unexpected color 0x0000ff00 (case 1, 3, size 0).
visual.c:11972: Test failed: Got unexpected color 0x0000ff00 (case 2, 3, size 0).
visual.c:11972: Test failed: Got unexpected color 0x0000ff00 (case 3, 3, size 0).
visual.c:11972: Test failed: Got unexpected color 0x0000ff00 (case 4, 3, size 0).
visual.c:11972: Test failed: Got unexpected color 0x00ff0000 (case 5, 3, size 0).
visual.c:11972: Test failed: Got unexpected color 0x0000ff00 (case 6, 3, size 0).
visual.c:11972: Test failed: Got unexpected color 0x00ff0000 (case 7, 3, size 0).
visual.c:11972: Test failed: Got unexpected color 0x0000ff00 (case 8, 3, size 0).
visual.c:11972: Test failed: Got unexpected color 0x00ff0000 (case 9, 3, size 0).
visual.c:11972: Test failed: Got unexpected color 0x0000ff00 (case 10, 7, size 0).
visual.c:11972: Test failed: Got unexpected color 0x0000ff00 (case 11, 7, size 0).
visual.c:11972: Test failed: Got unexpected color 0x0000ff00 (case 12, 7, size 0).
visual.c:20801: Test failed: Expected color 0x00000000, got 0x000000ff, format D3DFMT_Q8W8V8U8, test 0, location 3x2.
visual.c:20801: Test failed: Expected color 0x00000000, got 0x000000ff, format D3DFMT_Q8W8V8U8, test 2, location 3x2.
visual.c:22064: Test failed: Got unexpected color 00ffffff at x=64, format 80.
visual.c:22071: Test failed: Got unexpected color 000000ff at x=194, format 80.
visual.c:22081: Test failed: Got unexpected color 00000000 at x=446, format 80.
visual.c:22064: Test failed: Got unexpected color 00ffffff at x=64, format 77.
visual.c:22071: Test failed: Got unexpected color 000000ff at x=194, format 77.
visual.c:22081: Test failed: Got unexpected color 00000000 at x=446, format 77.
visual.c:22064: Test failed: Got unexpected color 00ffffff at x=64, format 75.
visual.c:22071: Test failed: Got unexpected color 000000ff at x=194, format 75.
visual.c:22081: Test failed: Got unexpected color 00000000 at x=446, format 75.
visual.c:22064: Test failed: Got unexpected color 00ffffff at x=64, format 1515474505.
visual.c:22071: Test failed: Got unexpected color 000000ff at x=194, format 1515474505.
visual.c:22081: Test failed: Got unexpected color 00000000 at x=446, format 1515474505.
visual.c:25211: Test failed: Expected unsynchronised map for flags 0x1000.
visual.c:25211: Test failed: Expected unsynchronised map for flags 0x3000.
ddraw
ddraw2.c:9700: Test failed: Test 0 shading has color1 000000ff, expected 0000ff00.
ddraw4.c:11476: Test failed: Test 0 shading has color1 000000ff, expected 0000ff00.
ddraw7.c:11485: Test failed: Test 0 shading has color1 000000ff, expected 0000ff00.
ddraw7.c:14422: Test failed: Expected unsynchronised map for flags 0x1000.
ddraw7.c:14422: Test failed: Expected unsynchronised map for flags 0x3000.
dinput
dinput.c:405: Test failed: guidProduct.Data2 is 7734
dinput.c:407: Test failed: guidProduct.Data3 is 11d2
dinput.c:409: Test failed: guidProduct.Data4 does not match: {9e573ed9-7734-11d2-8d4a-23903fb6bdf7}
dinput.c:405: Test failed: guidProduct.Data2 is 7734
dinput.c:407: Test failed: guidProduct.Data3 is 11d2
dinput.c:409: Test failed: guidProduct.Data4 does not match: {9e573ed9-7734-11d2-8d4a-23903fb6bdf7}
joystick.c:405: Test failed: IDirectInput_GetProperty() for DIPROP_GUIDANDPATH failed: 80004001
joystick.c:416: Test failed: DIPROP_GUIDANDPATH path has wrong format. Expected count: 2 Got: -1 Path: L""
joystick.c:418: Test failed: DIPROP_GUIDANDPATH path should contain either 'ig_' or 'mi_' substring. Path: L""
joystick.c:405: Test failed: IDirectInput_GetProperty() for DIPROP_GUIDANDPATH failed: 80004001
joystick.c:416: Test failed: DIPROP_GUIDANDPATH path has wrong format. Expected count: 2 Got: -1 Path: L""
joystick.c:418: Test failed: DIPROP_GUIDANDPATH path should contain either 'ig_' or 'mi_' substring. Path: L""
joystick.c:405: Test failed: IDirectInput_GetProperty() for DIPROP_GUIDANDPATH failed: 80004001
joystick.c:416: Test failed: DIPROP_GUIDANDPATH path has wrong format. Expected count: 2 Got: -1 Path: L""
joystick.c:418: Test failed: DIPROP_GUIDANDPATH path should contain either 'ig_' or 'mi_' substring. Path: L""
mouse.c:152: Test failed: Failed: 00000001
mouse.c:158: Test failed: Failed: 80070005
mouse.c:161: Test failed: Failed: 00000001
mouse.c:164: Test failed: Failed: 80070005
mouse.c:178: Test failed: GetDeviceData() failed: 00000000 cnt:0
dxgi
dxgi.c:2116: Test failed: Failed to get containing output, hr 0x887a0002.
Unhandled exception: page fault on execute access to 0x45455246 in 32-bit code (0x45455246).
gdi32
driver.c:81: Test failed: Got unexpected return code 0xc0000001.
driver.c:93: Test failed: Got unexpected value 0.
driver.c:97: Test failed: Got unexpected return code 0xc000000d.
font.c:6304: Test failed: expected vertical face for charset 128, got Droid Sans Fallback
font.c:6304: Test failed: expected vertical face for charset 129, got Droid Sans Fallback
font.c:6304: Test failed: expected vertical face for charset 130, got Droid Sans Fallback
font.c:6304: Test failed: expected vertical face for charset 134, got Droid Sans Fallback
font.c:6304: Test failed: expected vertical face for charset 136, got Droid Sans Fallback
kernel32
comm.c:919: Test failed: OutQueue should not be empty
Unhandled exception: page fault on write access to 0x00000000 in 32-bit code (0x00439de2).
debugger: Timeout
mmdevapi
render.c:1349: Test failed: Activation failed with 8889000a
render.c:1880: Test failed: Activation failed with 8889000a
mstask
task_scheduler.c:498: Test failed: got 0x80070020
quartz
filtergraph: Timeout
rsaenh
rsaenh.c:2391: Test failed: 8009000d
services.exe
service.c:422: Test failed: service: Unexpected monitor rcMonitor values: {1024,0,2048,739}
service.c:422: Test failed: service: Unexpected monitor rcWork values: {1024,0,2048,739}
service.c:422: Test failed: service: Unexpected szDevice received: \\.\DISPLAY2
service.c:422: Test failed: service: Unexpected secondary monitor info.
service.c:422: Test failed: service: Callback got called less or more than once. 2
urlmon
protocol.c:3656: Test failed: wait timed out
protocol: Timeout
url: Timeout
user32
msg.c:5148: Test succeeded inside todo block: ShowWindow(SW_SHOWMINIMIZED):overlapped: marked "todo_wine" but succeeds
sysparams.c:3251: Test failed: 0: wrong virt desktop rect (0,0)-(2048,768) expected (0,0)-(1024,768)
sysparams.c:3265: Test failed: 0: wrong caps virt desktop rect (0,0)-(2048,768) expected (0,0)-(1024,768)
sysparams.c:3251: Test failed: 1: wrong virt desktop rect (0,0)-(2048,768) expected (0,0)-(1024,768)
sysparams.c:3265: Test failed: 1: wrong caps virt desktop rect (0,0)-(2048,768) expected (0,0)-(1024,768)
sysparams.c:3251: Test failed: 2: wrong virt desktop rect (0,0)-(2048,768) expected (0,0)-(1024,768)
sysparams.c:3265: Test failed: 2: wrong caps virt desktop rect (0,0)-(2048,768) expected (0,0)-(1024,768)
sysparams.c:3343: Test failed: 0/0: wrong desktop resolution (0,0)-(2048,768) expected (0,0)-(1024,768)
sysparams.c:3343: Test failed: 0/1: wrong desktop resolution (0,0)-(2048,768) expected (0,0)-(1024,768)
sysparams.c:3343: Test failed: 0/2: wrong desktop resolution (0,0)-(2048,768) expected (0,0)-(1024,768)
sysparams.c:3343: Test failed: 1/0: wrong desktop resolution (0,0)-(2048,768) expected (0,0)-(1024,768)
sysparams.c:3343: Test failed: 1/1: wrong desktop resolution (0,0)-(2048,768) expected (0,0)-(1024,768)
sysparams.c:3343: Test failed: 1/2: wrong desktop resolution (0,0)-(2048,768) expected (0,0)-(1024,768)
sysparams.c:3343: Test failed: 2/0: wrong desktop resolution (0,0)-(2048,768) expected (0,0)-(1024,768)
sysparams.c:3343: Test failed: 2/1: wrong desktop resolution (0,0)-(2048,768) expected (0,0)-(1024,768)
sysparams.c:3343: Test failed: 2/2: wrong desktop resolution (0,0)-(2048,768) expected (0,0)-(1024,768)
wininet
http.c:6174: Test failed: req_error = 12045
http.c:6213: Test failed: Unexpected cert errors 12045, skipping security flags tests
winmm
mci: Timeout
Report errors
d3d11:d3d11 prints too much data (35751 bytes)
dxgi:dxgi crashed (c0000005)
kernel32:virtual prints too much data (91050 bytes)
opengl32:opengl has no test summary line (early exit of the main process?)
opengl32:opengl has unaccounted for todo messages
opengl32:opengl has unaccounted for skip messages
user32:msg prints too much data (35219 bytes)
vulkan-1:vulkan had no start line (or it is garbled)
Task log
X Error of failed request:  BadValue (integer parameter out of range for operation)
  Major opcode of failed request:  53 (X_CreatePixmap)

debian10 (32 bit WoW tests)

Debian 10 / vm4Debian 10 configured for Wine. Runs fvwm with 2 screens. [CPU:4*host RAM:3GB disk:virtio-scsi eth:virtio snd:ich9 GPU:qxl display:spice testagentd:1.7]
Missions: wow32,test=module
32 bit WoW report
d3d10core
d3d10core.c:4773: Test failed: Got unexpected CPrimitives count: 3.
d3d10core.c:4787: Test failed: Got unexpected CPrimitives count: 3.
d3d10core.c:4970: Test succeeded inside todo block: Got unexpected PrimitivesStorageNeeded: 0.
d3d10core.c:4980: Test succeeded inside todo block: Got unexpected PrimitivesStorageNeeded: 0.
d3d10core.c:7479: Test failed: Test 52: Got unexpected color 0xff0000ff at (0, 0).
d3d10core.c:7479: Test failed: Test 52: Got unexpected color 0xff00ffff at (1, 0).
d3d10core.c:7479: Test failed: Test 52: Got unexpected color 0xff00ff00 at (2, 0).
d3d10core.c:7479: Test failed: Test 52: Got unexpected color 0xffffff00 at (3, 0).
d3d10core.c:7479: Test failed: Test 52: Got unexpected color 0xffff0000 at (0, 1).
d3d10core.c:7479: Test failed: Test 52: Got unexpected color 0xffff00ff at (1, 1).
d3d10core.c:7479: Test failed: Test 52: Got unexpected color 0xff000000 at (2, 1).
d3d10core.c:7479: Test failed: Test 52: Got unexpected color 0xff7f7f7f at (3, 1).
d3d10core.c:7479: Test failed: Test 52: Got unexpected color 0xffffffff at (0, 2).
d3d10core.c:7479: Test failed: Test 52: Got unexpected color 0xffffffff at (1, 2).
d3d10core.c:7479: Test failed: Test 52: Got unexpected color 0xffffffff at (2, 2).
d3d10core.c:7479: Test failed: Test 52: Got unexpected color 0xff000000 at (3, 2).
d3d10core.c:7479: Test failed: Test 52: Got unexpected color 0xffffffff at (0, 3).
d3d10core.c:7479: Test failed: Test 52: Got unexpected color 0xff000000 at (2, 3).
d3d10core.c:7479: Test failed: Test 52: Got unexpected color 0xff000000 at (3, 3).
d3d10core.c:12598: Test failed: Got {-1.00003052e+000, 0.00000000e+000, 1.00000000e+000, 0.00000000e+000}, expected {-1.00000000e+000, 0.00000000e+000, 1.00000000e+000, 0.00000000e+000} at (0, 0), sub-resource 0.
d3d10core.c:12958: Test failed: Got {0x00000000, 0x00000000, 0x00000000, 0x00000000}, expected {0x00000000, 0xffffffff, 0x00000000, 0x00000000} at (0, 0), sub-resource 0.
d3d10core.c:12958: Test failed: Got {0x00000000, 0x00000000, 0x00000000, 0x00000000}, expected {0xffffffff, 0x00000000, 0x00000000, 0x00000000} at (0, 0), sub-resource 0.
d3d10core.c:12958: Test failed: Got {0xffffffff, 0x00000001, 0x00000000, 0x00000000}, expected {0x00000000, 0x00000001, 0x00000000, 0x00000000} at (0, 0), sub-resource 0.
d3d10core.c:12958: Test failed: Got {0x00000001, 0xffffffff, 0x00000000, 0x00000000}, expected {0x00000001, 0x00000000, 0x00000000, 0x00000000} at (0, 0), sub-resource 0.
d3d10core.c:12598: Test failed: Got {-1.00787401e+000, 0.00000000e+000, 1.00000000e+000, 5.03937006e-001}, expected {-1.00000000e+000, 0.00000000e+000, 1.00000000e+000, 5.03937006e-001} at (0, 0), sub-resource 0.
d3d10core.c:16920: Test failed: Resource type 1, test 7: pixel (200, 200) has color 00000000, expected ffff0000.
d3d10core.c:16920: Test failed: Resource type 1, test 7: pixel (280, 200) has color 00000000, expected ffff0000.
d3d10core.c:16920: Test failed: Resource type 1, test 7: pixel (360, 200) has color 00000000, expected ff00ff00.
d3d10core.c:16920: Test failed: Resource type 1, test 7: pixel (440, 200) has color 00000000, expected ff00ff00.
d3d10core.c:16920: Test failed: Resource type 1, test 7: pixel (200, 270) has color 00000000, expected ff0000ff.
d3d10core.c:16920: Test failed: Resource type 1, test 7: pixel (280, 270) has color 00000000, expected ff0000ff.
d3d10core.c:16920: Test failed: Resource type 1, test 7: pixel (360, 270) has color 00000000, expected ff000000.
d3d10core.c:16920: Test failed: Resource type 1, test 7: pixel (440, 270) has color 00000000, expected ff000000.
d3d10core.c:16920: Test failed: Resource type 1, test 8: pixel (200, 200) has color 00000000, expected ffff0000.
d3d10core.c:16920: Test failed: Resource type 1, test 8: pixel (280, 200) has color 00000000, expected ffff0000.
d3d10core.c:16920: Test failed: Resource type 1, test 8: pixel (360, 200) has color 00000000, expected ff00ff00.
d3d10core.c:16920: Test failed: Resource type 1, test 8: pixel (440, 200) has color 00000000, expected ff00ff00.
d3d10core.c:16920: Test failed: Resource type 1, test 8: pixel (200, 270) has color 00000000, expected ff0000ff.
d3d10core.c:16920: Test failed: Resource type 1, test 8: pixel (280, 270) has color 00000000, expected ff0000ff.
d3d10core.c:16920: Test failed: Resource type 1, test 8: pixel (360, 270) has color 00000000, expected ff000000.
d3d10core.c:16920: Test failed: Resource type 1, test 8: pixel (440, 270) has color 00000000, expected ff000000.
d3d10core.c:16920: Test failed: Resource type 2, test 7: pixel (200, 200) has color 00000000, expected ffff0000.
d3d10core.c:16920: Test failed: Resource type 2, test 7: pixel (280, 200) has color 00000000, expected ffff0000.
d3d10core.c:16920: Test failed: Resource type 2, test 7: pixel (360, 200) has color 00000000, expected ff00ff00.
d3d10core.c:16920: Test failed: Resource type 2, test 7: pixel (440, 200) has color 00000000, expected ff00ff00.
d3d10core.c:16920: Test failed: Resource type 2, test 7: pixel (200, 270) has color 00000000, expected ff0000ff.
d3d10core.c:16920: Test failed: Resource type 2, test 7: pixel (280, 270) has color 00000000, expected ff0000ff.
d3d10core.c:16920: Test failed: Resource type 2, test 7: pixel (360, 270) has color 00000000, expected ff000000.
d3d10core.c:16920: Test failed: Resource type 2, test 7: pixel (440, 270) has color 00000000, expected ff000000.
d3d10core.c:16920: Test failed: Resource type 2, test 8: pixel (200, 200) has color 00000000, expected ffff0000.
d3d10core.c:16920: Test failed: Resource type 2, test 8: pixel (280, 200) has color 00000000, expected ffff0000.
d3d10core.c:16920: Test failed: Resource type 2, test 8: pixel (360, 200) has color 00000000, expected ff00ff00.
d3d10core.c:16920: Test failed: Resource type 2, test 8: pixel (440, 200) has color 00000000, expected ff00ff00.
d3d10core.c:16920: Test failed: Resource type 2, test 8: pixel (200, 270) has color 00000000, expected ff0000ff.
d3d10core.c:16920: Test failed: Resource type 2, test 8: pixel (280, 270) has color 00000000, expected ff0000ff.
d3d10core.c:16920: Test failed: Resource type 2, test 8: pixel (360, 270) has color 00000000, expected ff000000.
d3d10core.c:16920: Test failed: Resource type 2, test 8: pixel (440, 270) has color 00000000, expected ff000000.
d3d10core.c:16920: Test failed: Resource type 3, test 7: pixel (200, 200) has color 00000000, expected ffff0000.
d3d10core.c:16920: Test failed: Resource type 3, test 7: pixel (280, 200) has color 00000000, expected ffff0000.
d3d10core.c:16920: Test failed: Resource type 3, test 7: pixel (360, 200) has color 00000000, expected ff00ff00.
d3d10core.c:16920: Test failed: Resource type 3, test 7: pixel (440, 200) has color 00000000, expected ff00ff00.
d3d10core.c:16920: Test failed: Resource type 3, test 7: pixel (200, 270) has color 00000000, expected ff0000ff.
d3d10core.c:16920: Test failed: Resource type 3, test 7: pixel (280, 270) has color 00000000, expected ff0000ff.
d3d10core.c:16920: Test failed: Resource type 3, test 7: pixel (360, 270) has color 00000000, expected ff000000.
d3d10core.c:16920: Test failed: Resource type 3, test 7: pixel (440, 270) has color 00000000, expected ff000000.
d3d10core.c:16920: Test failed: Resource type 3, test 8: pixel (200, 200) has color 00000000, expected ffff0000.
d3d10core.c:16920: Test failed: Resource type 3, test 8: pixel (280, 200) has color 00000000, expected ffff0000.
d3d10core.c:16920: Test failed: Resource type 3, test 8: pixel (360, 200) has color 00000000, expected ff00ff00.
d3d10core.c:16920: Test failed: Resource type 3, test 8: pixel (440, 200) has color 00000000, expected ff00ff00.
d3d10core.c:16920: Test failed: Resource type 3, test 8: pixel (200, 270) has color 00000000, expected ff0000ff.
d3d10core.c:16920: Test failed: Resource type 3, test 8: pixel (280, 270) has color 00000000, expected ff0000ff.
d3d10core.c:16920: Test failed: Resource type 3, test 8: pixel (360, 270) has color 00000000, expected ff000000.
d3d10core.c:16920: Test failed: Resource type 3, test 8: pixel (440, 270) has color 00000000, expected ff000000.
d3d10core.c:15852: Test failed: Got depth 2.51951814e-003, expected 2.51948950e-003.
d3d10core.c:15852: Test failed: Got depth 2.51951814e-003, expected 2.51948950e-003.
d3d10core.c:15852: Test failed: Got depth 1.27950311e-003, expected 1.27948953e-003.
d3d10core.c:15852: Test failed: Got depth 1.27950311e-003, expected 1.27948953e-003.
d3d10core.c:15852: Test failed: Got depth 1.27950311e-003, expected 1.27948953e-003.
d3d10core.c:15852: Test failed: Got depth 1.27950311e-003, expected 1.27948953e-003.
d3d10core.c:15852: Test failed: Got depth 1.27950311e-003, expected 1.27948953e-003.
d3d10core.c:15852: Test failed: Got depth 1.27950311e-003, expected 1.27948953e-003.
d3d10core.c:15852: Test failed: Got depth 5.03277779e-003, expected 5.03897900e-003.
d3d10core.c:15852: Test failed: Got depth 5.03277779e-003, expected 5.03897900e-003.
d3d10core.c:15852: Test failed: Got depth 2.54905224e-003, expected 2.54897905e-003.
d3d10core.c:15852: Test failed: Got depth 7.52645731e-003, expected 7.53897894e-003.
d3d10core.c:15852: Test failed: Got depth 7.52645731e-003, expected 7.53897894e-003.
d3d10core.c:15852: Test failed: Got depth 2.54905224e-003, expected 2.54897905e-003.
d3d10core.c:15852: Test failed: Got depth 1.25139356e-002, expected 1.25389788e-002.
d3d10core.c:15852: Test failed: Got depth 1.25139356e-002, expected 1.25389788e-002.
d3d10core.c:15852: Test failed: Got depth 2.54905224e-003, expected 2.54897905e-003.
d3d10core.c:15852: Test failed: Got depth 6.40938997e-001, expected 6.42538965e-001.
d3d10core.c:15852: Test failed: Got depth 6.40938997e-001, expected 6.42538965e-001.
d3d10core.c:15852: Test failed: Got depth 2.54905224e-003, expected 2.54897905e-003.
d3d10core.c:15852: Test failed: Got depth 2.54905224e-003, expected 2.54897905e-003.
d3d10core.c:15852: Test failed: Got depth 2.54905224e-003, expected 2.54897905e-003.
d3d10core.c:15860: Test failed: Got value 0x149d4 (5.03277809e-003), expected 0x14a3c (5.03897697e-003).
d3d10core.c:15860: Test failed: Got value 0x149d4 (5.03277809e-003), expected 0x14a3c (5.03897697e-003).
d3d10core.c:15860: Test failed: Got value 0x5c5c2 (2.25487961e-002), expected 0x5c5c6 (2.25490345e-002).
d3d10core.c:15860: Test failed: Got value 0x1ed41 (7.52645776e-003), expected 0x1ee13 (7.53897473e-003).
d3d10core.c:15860: Test failed: Got value 0x1ed41 (7.52645776e-003), expected 0x1ee13 (7.53897473e-003).
d3d10core.c:15860: Test failed: Got value 0x5c5c2 (2.25487961e-002), expected 0x5c5c6 (2.25490345e-002).
d3d10core.c:15860: Test failed: Got value 0x3341d (1.25139363e-002), expected 0x335c1 (1.25389703e-002).
d3d10core.c:15860: Test failed: Got value 0x3341d (1.25139363e-002), expected 0x335c1 (1.25389703e-002).
d3d10core.c:15860: Test failed: Got value 0x5c5c2 (2.25487961e-002), expected 0x5c5c6 (2.25490345e-002).
d3d10core.c:15860: Test failed: Got value 0xa41493 (6.40938976e-001), expected 0xa47d6e (6.42538943e-001).
d3d10core.c:15860: Test failed: Got value 0xa41493 (6.40938976e-001), expected 0xa47d6e (6.42538943e-001).
d3d10core.c:15860: Test failed: Got value 0x5c5c2 (2.25487961e-002), expected 0x5c5c6 (2.25490345e-002).
d3d10core.c:15860: Test failed: Got value 0x5c5c2 (2.25487961e-002), expected 0x5c5c6 (2.25490345e-002).
d3d10core.c:15860: Test failed: Got value 0x5c5c2 (2.25487961e-002), expected 0x5c5c6 (2.25490345e-002).
d3d10core.c:15869: Test failed: Got value 0x3d8 (1.50148775e-002), expected 0x3da (1.50453956e-002).
d3d10core.c:15869: Test failed: Got value 0x3d8 (1.50148775e-002), expected 0x3da (1.50453956e-002).
d3d10core.c:15869: Test failed: Got value 0x333 (1.24971389e-002), expected 0x336 (1.25429160e-002).
d3d10core.c:15869: Test failed: Got value 0x333 (1.24971389e-002), expected 0x336 (1.25429160e-002).
d3d10core.c:15869: Test failed: Got value 0x479 (1.74715801e-002), expected 0x47d (1.75326162e-002).
d3d10core.c:15869: Test failed: Got value 0x479 (1.74715801e-002), expected 0x47d (1.75326162e-002).
d3d10core.c:15869: Test failed: Got value 0xa414 (6.40939956e-001), expected 0xa47c (6.42526894e-001).
d3d10core.c:15869: Test failed: Got value 0xa414 (6.40939956e-001), expected 0xa47c (6.42526894e-001).
d3d11
d3d11.c:5782: Test failed: Got unexpected CPrimitives count: 3.
d3d11.c:5785: Test failed: Got unexpected HSInvocations count: 4.
d3d11.c:5786: Test failed: Got unexpected DSInvocations count: 4.
d3d11.c:5787: Test failed: Got unexpected CSInvocations count: 311040.
d3d11.c:5799: Test failed: Got unexpected CPrimitives count: 3.
d3d11.c:5801: Test failed: Got unexpected HSInvocations count: 4.
d3d11.c:5802: Test failed: Got unexpected DSInvocations count: 4.
d3d11.c:5803: Test failed: Got unexpected CSInvocations count: 311040.
d3d11.c:6109: Test succeeded inside todo block: Got unexpected PrimitivesStorageNeeded: 0.
d3d11.c:6119: Test succeeded inside todo block: Got unexpected PrimitivesStorageNeeded: 0.
d3d11.c:8316: Test failed: Test 60: Got unexpected color 0xff0000ff at (0, 0).
d3d11.c:8316: Test failed: Test 60: Got unexpected color 0xff00ffff at (1, 0).
d3d11.c:8316: Test failed: Test 60: Got unexpected color 0xff00ff00 at (2, 0).
d3d11.c:8316: Test failed: Test 60: Got unexpected color 0xffffff00 at (3, 0).
d3d11.c:8316: Test failed: Test 60: Got unexpected color 0xffff0000 at (0, 1).
d3d11.c:8316: Test failed: Test 60: Got unexpected color 0xffff00ff at (1, 1).
d3d11.c:8316: Test failed: Test 60: Got unexpected color 0xff000000 at (2, 1).
d3d11.c:8316: Test failed: Test 60: Got unexpected color 0xff7f7f7f at (3, 1).
d3d11.c:8316: Test failed: Test 60: Got unexpected color 0xffffffff at (0, 2).
d3d11.c:8316: Test failed: Test 60: Got unexpected color 0xffffffff at (1, 2).
d3d11.c:8316: Test failed: Test 60: Got unexpected color 0xffffffff at (2, 2).
d3d11.c:8316: Test failed: Test 60: Got unexpected color 0xff000000 at (3, 2).
d3d11.c:8316: Test failed: Test 60: Got unexpected color 0xffffffff at (0, 3).
d3d11.c:8316: Test failed: Test 60: Got unexpected color 0xff000000 at (2, 3).
d3d11.c:8316: Test failed: Test 60: Got unexpected color 0xff000000 at (3, 3).
d3d11.c:16860: Test failed: Got {-1.00003052e+000, 0.00000000e+000, 1.00000000e+000, 0.00000000e+000}, expected {-1.00000000e+000, 0.00000000e+000, 1.00000000e+000, 0.00000000e+000} at (0, 0), sub-resource 0.
d3d11.c:17958: Test failed: Got {0x00000000, 0x00000000, 0x00000000, 0x00000000}, expected {0x00000000, 0xffffffff, 0x00000000, 0x00000000} at (0, 0), sub-resource 0.
d3d11.c:17958: Test failed: Got {0x00000000, 0x00000000, 0x00000000, 0x00000000}, expected {0xffffffff, 0x00000000, 0x00000000, 0x00000000} at (0, 0), sub-resource 0.
d3d11.c:17958: Test failed: Got {0xffffffff, 0x00000001, 0x00000000, 0x00000000}, expected {0x00000000, 0x00000001, 0x00000000, 0x00000000} at (0, 0), sub-resource 0.
d3d11.c:17958: Test failed: Got {0x00000001, 0xffffffff, 0x00000000, 0x00000000}, expected {0x00000001, 0x00000000, 0x00000000, 0x00000000} at (0, 0), sub-resource 0.
d3d11.c:16860: Test failed: Got {-1.00787401e+000, 0.00000000e+000, 1.00000000e+000, 5.03937006e-001}, expected {-1.00000000e+000, 0.00000000e+000, 1.00000000e+000, 5.03937006e-001} at (0, 0), sub-resource 0.
d3d11.c:27602: Test failed: Resource type 1, test 7: pixel (200, 200) has color 00000000, expected ffff0000.
d3d11.c:27602: Test failed: Resource type 1, test 7: pixel (280, 200) has color 00000000, expected ffff0000.
d3d11.c:27602: Test failed: Resource type 1, test 7: pixel (360, 200) has color 00000000, expected ff00ff00.
d3d11.c:27602: Test failed: Resource type 1, test 7: pixel (440, 200) has color 00000000, expected ff00ff00.
d3d11.c:27602: Test failed: Resource type 1, test 7: pixel (200, 270) has color 00000000, expected ff0000ff.
d3d11.c:27602: Test failed: Resource type 1, test 7: pixel (280, 270) has color 00000000, expected ff0000ff.
d3d11.c:27602: Test failed: Resource type 1, test 7: pixel (360, 270) has color 00000000, expected ff000000.
d3d11.c:27602: Test failed: Resource type 1, test 7: pixel (440, 270) has color 00000000, expected ff000000.
d3d11.c:27602: Test failed: Resource type 1, test 8: pixel (200, 200) has color 00000000, expected ffff0000.
d3d11.c:27602: Test failed: Resource type 1, test 8: pixel (280, 200) has color 00000000, expected ffff0000.
d3d11.c:27602: Test failed: Resource type 1, test 8: pixel (360, 200) has color 00000000, expected ff00ff00.
d3d11.c:27602: Test failed: Resource type 1, test 8: pixel (440, 200) has color 00000000, expected ff00ff00.
d3d11.c:27602: Test failed: Resource type 1, test 8: pixel (200, 270) has color 00000000, expected ff0000ff.
d3d11.c:27602: Test failed: Resource type 1, test 8: pixel (280, 270) has color 00000000, expected ff0000ff.
d3d11.c:27602: Test failed: Resource type 1, test 8: pixel (360, 270) has color 00000000, expected ff000000.
d3d11.c:27602: Test failed: Resource type 1, test 8: pixel (440, 270) has color 00000000, expected ff000000.
d3d11.c:27602: Test failed: Resource type 2, test 7: pixel (200, 200) has color 00000000, expected ffff0000.
d3d11.c:27602: Test failed: Resource type 2, test 7: pixel (280, 200) has color 00000000, expected ffff0000.
d3d11.c:27602: Test failed: Resource type 2, test 7: pixel (360, 200) has color 00000000, expected ff00ff00.
d3d11.c:27602: Test failed: Resource type 2, test 7: pixel (440, 200) has color 00000000, expected ff00ff00.
d3d11.c:27602: Test failed: Resource type 2, test 7: pixel (200, 270) has color 00000000, expected ff0000ff.
d3d11.c:27602: Test failed: Resource type 2, test 7: pixel (280, 270) has color 00000000, expected ff0000ff.
d3d11.c:27602: Test failed: Resource type 2, test 7: pixel (360, 270) has color 00000000, expected ff000000.
d3d11.c:27602: Test failed: Resource type 2, test 7: pixel (440, 270) has color 00000000, expected ff000000.
d3d11.c:27602: Test failed: Resource type 2, test 8: pixel (200, 200) has color 00000000, expected ffff0000.
d3d11.c:27602: Test failed: Resource type 2, test 8: pixel (280, 200) has color 00000000, expected ffff0000.
d3d11.c:27602: Test failed: Resource type 2, test 8: pixel (360, 200) has color 00000000, expected ff00ff00.
d3d11.c:27602: Test failed: Resource type 2, test 8: pixel (440, 200) has color 00000000, expected ff00ff00.
d3d11.c:27602: Test failed: Resource type 2, test 8: pixel (200, 270) has color 00000000, expected ff0000ff.
d3d11.c:27602: Test failed: Resource type 2, test 8: pixel (280, 270) has color 00000000, expected ff0000ff.
d3d11.c:27602: Test failed: Resource type 2, test 8: pixel (360, 270) has color 00000000, expected ff000000.
d3d11.c:27602: Test failed: Resource type 2, test 8: pixel (440, 270) has color 00000000, expected ff000000.
d3d11.c:27602: Test failed: Resource type 3, test 7: pixel (200, 200) has color 00000000, expected ffff0000.
d3d11.c:27602: Test failed: Resource type 3, test 7: pixel (280, 200) has color 00000000, expected ffff0000.
d3d11.c:27602: Test failed: Resource type 3, test 7: pixel (360, 200) has color 00000000, expected ff00ff00.
d3d11.c:27602: Test failed: Resource type 3, test 7: pixel (440, 200) has color 00000000, expected ff00ff00.
d3d11.c:27602: Test failed: Resource type 3, test 7: pixel (200, 270) has color 00000000, expected ff0000ff.
d3d11.c:27602: Test failed: Resource type 3, test 7: pixel (280, 270) has color 00000000, expected ff0000ff.
d3d11.c:27602: Test failed: Resource type 3, test 7: pixel (360, 270) has color 00000000, expected ff000000.
d3d11.c:27602: Test failed: Resource type 3, test 7: pixel (440, 270) has color 00000000, expected ff000000.
d3d11.c:27602: Test failed: Resource type 3, test 8: pixel (200, 200) has color 00000000, expected ffff0000.
d3d11.c:27602: Test failed: Resource type 3, test 8: pixel (280, 200) has color 00000000, expected ffff0000.
d3d11.c:27602: Test failed: Resource type 3, test 8: pixel (360, 200) has color 00000000, expected ff00ff00.
d3d11.c:27602: Test failed: Resource type 3, test 8: pixel (440, 200) has color 00000000, expected ff00ff00.
d3d11.c:27602: Test failed: Resource type 3, test 8: pixel (200, 270) has color 00000000, expected ff0000ff.
d3d11.c:27602: Test failed: Resource type 3, test 8: pixel (280, 270) has color 00000000, expected ff0000ff.
d3d11.c:27602: Test failed: Resource type 3, test 8: pixel (360, 270) has color 00000000, expected ff000000.
d3d11.c:27602: Test failed: Resource type 3, test 8: pixel (440, 270) has color 00000000, expected ff000000.
d3d11.c:25838: Test failed: Got depth 2.51951814e-003, expected 2.51948950e-003.
d3d11.c:25838: Test failed: Got depth 2.51951814e-003, expected 2.51948950e-003.
d3d11.c:25838: Test failed: Got depth 1.27950311e-003, expected 1.27948953e-003.
d3d11.c:25838: Test failed: Got depth 1.27950311e-003, expected 1.27948953e-003.
d3d11.c:25838: Test failed: Got depth 1.27950311e-003, expected 1.27948953e-003.
d3d11.c:25838: Test failed: Got depth 1.27950311e-003, expected 1.27948953e-003.
d3d11.c:25838: Test failed: Got depth 1.27950311e-003, expected 1.27948953e-003.
d3d11.c:25838: Test failed: Got depth 1.27950311e-003, expected 1.27948953e-003.
d3d11.c:25838: Test failed: Got depth 5.03277779e-003, expected 5.03897900e-003.
d3d11.c:25838: Test failed: Got depth 5.03277779e-003, expected 5.03897900e-003.
d3d11.c:25838: Test failed: Got depth 2.54905224e-003, expected 2.54897905e-003.
d3d11.c:25838: Test failed: Got depth 7.52645731e-003, expected 7.53897894e-003.
d3d11.c:25838: Test failed: Got depth 7.52645731e-003, expected 7.53897894e-003.
d3d11.c:25838: Test failed: Got depth 2.54905224e-003, expected 2.54897905e-003.
d3d11.c:25838: Test failed: Got depth 1.25139356e-002, expected 1.25389788e-002.
d3d11.c:25838: Test failed: Got depth 1.25139356e-002, expected 1.25389788e-002.
d3d11.c:25838: Test failed: Got depth 2.54905224e-003, expected 2.54897905e-003.
d3d11.c:25838: Test failed: Got depth 6.40938997e-001, expected 6.42538965e-001.
d3d11.c:25838: Test failed: Got depth 6.40938997e-001, expected 6.42538965e-001.
d3d11.c:25838: Test failed: Got depth 2.54905224e-003, expected 2.54897905e-003.
d3d11.c:25838: Test failed: Got depth 2.54905224e-003, expected 2.54897905e-003.
d3d11.c:25838: Test failed: Got depth 2.54905224e-003, expected 2.54897905e-003.
d3d11.c:25846: Test failed: Got value 0x149d4 (5.03277809e-003), expected 0x14a3c (5.03897697e-003).
d3d11.c:25846: Test failed: Got value 0x149d4 (5.03277809e-003), expected 0x14a3c (5.03897697e-003).
d3d11.c:25846: Test failed: Got value 0x5c5c2 (2.25487961e-002), expected 0x5c5c6 (2.25490345e-002).
d3d11.c:25846: Test failed: Got value 0x1ed41 (7.52645776e-003), expected 0x1ee13 (7.53897473e-003).
d3d11.c:25846: Test failed: Got value 0x1ed41 (7.52645776e-003), expected 0x1ee13 (7.53897473e-003).
d3d11.c:25846: Test failed: Got value 0x5c5c2 (2.25487961e-002), expected 0x5c5c6 (2.25490345e-002).
d3d11.c:25846: Test failed: Got value 0x3341d (1.25139363e-002), expected 0x335c1 (1.25389703e-002).
d3d11.c:25846: Test failed: Got value 0x3341d (1.25139363e-002), expected 0x335c1 (1.25389703e-002).
d3d11.c:25846: Test failed: Got value 0x5c5c2 (2.25487961e-002), expected 0x5c5c6 (2.25490345e-002).
d3d11.c:25846: Test failed: Got value 0xa41493 (6.40938976e-001), expected 0xa47d6e (6.42538943e-001).
d3d11.c:25846: Test failed: Got value 0xa41493 (6.40938976e-001), expected 0xa47d6e (6.42538943e-001).
d3d11.c:25846: Test failed: Got value 0x5c5c2 (2.25487961e-002), expected 0x5c5c6 (2.25490345e-002).
d3d11.c:25846: Test failed: Got value 0x5c5c2 (2.25487961e-002), expected 0x5c5c6 (2.25490345e-002).
d3d11.c:25846: Test failed: Got value 0x5c5c2 (2.25487961e-002), expected 0x5c5c6 (2.25490345e-002).
d3d11.c:25855: Test failed: Got value 0x3d8 (1.50148775e-002), expected 0x3da (1.50453956e-002).
d3d11.c:25855: Test failed: Got value 0x3d8 (1.50148775e-002), expected 0x3da (1.50453956e-002).
d3d11.c:25855: Test failed: Got value 0x333 (1.24971389e-002), expected 0x336 (1.25429160e-002).
d3d11.c:25855: Test failed: Got value 0x333 (1.24971389e-002), expected 0x336 (1.25429160e-002).
d3d11.c:25855: Test failed: Got value 0x479 (1.74715801e-002), expected 0x47d (1.75326162e-002).
d3d11.c:25855: Test failed: Got value 0x479 (1.74715801e-002), expected 0x47d (1.75326162e-002).
d3d11.c:25855: Test failed: Got value 0xa414 (6.40939956e-001), expected 0xa47c (6.42526894e-001).
d3d11.c:25855: Test failed: Got value 0xa414 (6.40939956e-001), expected 0xa47c (6.42526894e-001).
d3d8
visual.c:6623: Test failed: Expected color 0x00000000, got 0x000000ff, format D3DFMT_Q8W8V8U8, test 0, location 3x2.
visual.c:6623: Test failed: Expected color 0x00000000, got 0x000000ff, format D3DFMT_Q8W8V8U8, test 2, location 3x2.
visual.c:7464: Test failed: Got unexpected color 0x0000ff00 (case 0, 3, size 0).
visual.c:7464: Test failed: Got unexpected color 0x0000ff00 (case 1, 3, size 0).
visual.c:7464: Test failed: Got unexpected color 0x0000ff00 (case 2, 3, size 0).
visual.c:7464: Test failed: Got unexpected color 0x0000ff00 (case 3, 3, size 0).
visual.c:7464: Test failed: Got unexpected color 0x0000ff00 (case 4, 7, size 0).
visual.c:7464: Test failed: Got unexpected color 0x0000ff00 (case 5, 7, size 0).
visual.c:8791: Test failed: Test 0 shading has color1 000000ff, expected 0000ff00.
visual.c:8791: Test failed: Test 6 shading has color1 000000ff, expected 0000ff00.
visual.c:8791: Test failed: Test 10 shading has color1 000000ff, expected 0000ff00.
visual.c:8791: Test failed: Test 11 shading has color1 000000ff, expected 0000ff00.
visual.c:10297: Test failed: Expected unsynchronised map for flags 0x1000.
visual.c:10297: Test failed: Expected unsynchronised map for flags 0x3000.
d3d9
d3d9ex.c:3133: Test failed: Expected message 0x46 for window 0x1, but didn't receive it, i=0.
device.c:4624: Test failed: Received unexpected WM_SIZE message.
device.c:6094: Test failed: Got unexpected hr 0x1.
device.c:6098: Test failed: Got unexpected hr 0x1.
device.c:6099: Test failed: Got unexpected query result 0xffffffffffffffff.
device: Timeout
visual.c:9410: Test failed: Test 0 shading has color1 000000ff, expected 0000ff00.
visual.c:9410: Test failed: Test 6 shading has color1 000000ff, expected 0000ff00.
visual.c:9410: Test failed: Test 10 shading has color1 000000ff, expected 0000ff00.
visual.c:9410: Test failed: Test 11 shading has color1 000000ff, expected 0000ff00.
visual.c:9410: Test failed: Test 12 shading has color1 000000ff, expected 0000ff00.
visual.c:11972: Test failed: Got unexpected color 0x0000ff00 (case 0, 3, size 0).
visual.c:11972: Test failed: Got unexpected color 0x0000ff00 (case 1, 3, size 0).
visual.c:11972: Test failed: Got unexpected color 0x0000ff00 (case 2, 3, size 0).
visual.c:11972: Test failed: Got unexpected color 0x0000ff00 (case 3, 3, size 0).
visual.c:11972: Test failed: Got unexpected color 0x0000ff00 (case 4, 3, size 0).
visual.c:11972: Test failed: Got unexpected color 0x00ff0000 (case 5, 3, size 0).
visual.c:11972: Test failed: Got unexpected color 0x0000ff00 (case 6, 3, size 0).
visual.c:11972: Test failed: Got unexpected color 0x00ff0000 (case 7, 3, size 0).
visual.c:11972: Test failed: Got unexpected color 0x0000ff00 (case 8, 3, size 0).
visual.c:11972: Test failed: Got unexpected color 0x00ff0000 (case 9, 3, size 0).
visual.c:11972: Test failed: Got unexpected color 0x0000ff00 (case 10, 7, size 0).
visual.c:11972: Test failed: Got unexpected color 0x0000ff00 (case 11, 7, size 0).
visual.c:11972: Test failed: Got unexpected color 0x0000ff00 (case 12, 7, size 0).
visual.c:20801: Test failed: Expected color 0x00000000, got 0x000000ff, format D3DFMT_Q8W8V8U8, test 0, location 3x2.
visual.c:20801: Test failed: Expected color 0x00000000, got 0x000000ff, format D3DFMT_Q8W8V8U8, test 2, location 3x2.
visual.c:22064: Test failed: Got unexpected color 00ffffff at x=64, format 80.
visual.c:22071: Test failed: Got unexpected color 000000ff at x=194, format 80.
visual.c:22081: Test failed: Got unexpected color 00000000 at x=446, format 80.
visual.c:22064: Test failed: Got unexpected color 00ffffff at x=64, format 77.
visual.c:22071: Test failed: Got unexpected color 000000ff at x=194, format 77.
visual.c:22081: Test failed: Got unexpected color 00000000 at x=446, format 77.
visual.c:22064: Test failed: Got unexpected color 00ffffff at x=64, format 75.
visual.c:22071: Test failed: Got unexpected color 000000ff at x=194, format 75.
visual.c:22081: Test failed: Got unexpected color 00000000 at x=446, format 75.
visual.c:22064: Test failed: Got unexpected color 00ffffff at x=64, format 1515474505.
visual.c:22071: Test failed: Got unexpected color 000000ff at x=194, format 1515474505.
visual.c:22081: Test failed: Got unexpected color 00000000 at x=446, format 1515474505.
visual.c:25211: Test failed: Expected unsynchronised map for flags 0x1000.
visual.c:25211: Test failed: Expected unsynchronised map for flags 0x3000.
ddraw
ddraw2.c:9700: Test failed: Test 0 shading has color1 000000ff, expected 0000ff00.
ddraw4.c:11476: Test failed: Test 0 shading has color1 000000ff, expected 0000ff00.
ddraw7.c:11485: Test failed: Test 0 shading has color1 000000ff, expected 0000ff00.
ddraw7.c:14422: Test failed: Expected unsynchronised map for flags 0x1000.
ddraw7.c:14422: Test failed: Expected unsynchronised map for flags 0x3000.
dinput
dinput.c:405: Test failed: guidProduct.Data2 is 7734
dinput.c:407: Test failed: guidProduct.Data3 is 11d2
dinput.c:409: Test failed: guidProduct.Data4 does not match: {9e573ed9-7734-11d2-8d4a-23903fb6bdf7}
dinput.c:405: Test failed: guidProduct.Data2 is 7734
dinput.c:407: Test failed: guidProduct.Data3 is 11d2
dinput.c:409: Test failed: guidProduct.Data4 does not match: {9e573ed9-7734-11d2-8d4a-23903fb6bdf7}
joystick.c:405: Test failed: IDirectInput_GetProperty() for DIPROP_GUIDANDPATH failed: 80004001
joystick.c:416: Test failed: DIPROP_GUIDANDPATH path has wrong format. Expected count: 2 Got: -1 Path: L""
joystick.c:418: Test failed: DIPROP_GUIDANDPATH path should contain either 'ig_' or 'mi_' substring. Path: L""
joystick.c:405: Test failed: IDirectInput_GetProperty() for DIPROP_GUIDANDPATH failed: 80004001
joystick.c:416: Test failed: DIPROP_GUIDANDPATH path has wrong format. Expected count: 2 Got: -1 Path: L""
joystick.c:418: Test failed: DIPROP_GUIDANDPATH path should contain either 'ig_' or 'mi_' substring. Path: L""
joystick.c:405: Test failed: IDirectInput_GetProperty() for DIPROP_GUIDANDPATH failed: 80004001
joystick.c:416: Test failed: DIPROP_GUIDANDPATH path has wrong format. Expected count: 2 Got: -1 Path: L""
joystick.c:418: Test failed: DIPROP_GUIDANDPATH path should contain either 'ig_' or 'mi_' substring. Path: L""
mouse.c:152: Test failed: Failed: 00000001
mouse.c:158: Test failed: Failed: 80070005
mouse.c:161: Test failed: Failed: 00000001
mouse.c:164: Test failed: Failed: 80070005
mouse.c:178: Test failed: GetDeviceData() failed: 00000000 cnt:0
dxgi
dxgi.c:2116: Test failed: Failed to get containing output, hr 0x887a0002.
Unhandled exception: page fault on execute access to 0x00455355 in 32-bit code (0x00455355).
gdi32
driver.c:81: Test failed: Got unexpected return code 0xc0000001.
driver.c:93: Test failed: Got unexpected value 0.
driver.c:97: Test failed: Got unexpected return code 0xc000000d.
kernel32
comm.c:919: Test failed: OutQueue should not be empty
Unhandled exception: page fault on write access to 0x00000000 in 32-bit code (0x00439de2).
mmdevapi
capture.c:239: Test failed: GCP 16129 past ReleaseBuffer(0) initially 15622
render.c:1349: Test failed: Activation failed with 8889000a
render.c:1880: Test failed: Activation failed with 8889000a
ole32
clipboard.c:1049: Test failed: OleIsCurrentClipboard returned 0
clipboard.c:1117: Test failed: 1 WM_DRAWCLIPBOARD received
rsaenh
rsaenh.c:2391: Test failed: 8009000d
services.exe
service.c:422: Test failed: service: Unexpected monitor rcMonitor values: {1024,0,2048,739}
service.c:422: Test failed: service: Unexpected monitor rcWork values: {1024,0,2048,739}
service.c:422: Test failed: service: Unexpected szDevice received: \\.\DISPLAY2
service.c:422: Test failed: service: Unexpected secondary monitor info.
service.c:422: Test failed: service: Callback got called less or more than once. 2
urlmon
protocol.c:3656: Test failed: wait timed out
protocol: Timeout
url: Timeout
user32
msg.c:5148: Test succeeded inside todo block: ShowWindow(SW_SHOWMINIMIZED):overlapped: marked "todo_wine" but succeeds
sysparams.c:3251: Test failed: 0: wrong virt desktop rect (0,0)-(2048,768) expected (0,0)-(1024,768)
sysparams.c:3265: Test failed: 0: wrong caps virt desktop rect (0,0)-(2048,768) expected (0,0)-(1024,768)
sysparams.c:3251: Test failed: 1: wrong virt desktop rect (0,0)-(2048,768) expected (0,0)-(1024,768)
sysparams.c:3265: Test failed: 1: wrong caps virt desktop rect (0,0)-(2048,768) expected (0,0)-(1024,768)
sysparams.c:3251: Test failed: 2: wrong virt desktop rect (0,0)-(2048,768) expected (0,0)-(1024,768)
sysparams.c:3265: Test failed: 2: wrong caps virt desktop rect (0,0)-(2048,768) expected (0,0)-(1024,768)
sysparams.c:3343: Test failed: 0/0: wrong desktop resolution (0,0)-(2048,768) expected (0,0)-(1024,768)
sysparams.c:3343: Test failed: 0/1: wrong desktop resolution (0,0)-(2048,768) expected (0,0)-(1024,768)
sysparams.c:3343: Test failed: 0/2: wrong desktop resolution (0,0)-(2048,768) expected (0,0)-(1024,768)
sysparams.c:3343: Test failed: 1/0: wrong desktop resolution (0,0)-(2048,768) expected (0,0)-(1024,768)
sysparams.c:3343: Test failed: 1/1: wrong desktop resolution (0,0)-(2048,768) expected (0,0)-(1024,768)
sysparams.c:3343: Test failed: 1/2: wrong desktop resolution (0,0)-(2048,768) expected (0,0)-(1024,768)
sysparams.c:3343: Test failed: 2/0: wrong desktop resolution (0,0)-(2048,768) expected (0,0)-(1024,768)
sysparams.c:3343: Test failed: 2/1: wrong desktop resolution (0,0)-(2048,768) expected (0,0)-(1024,768)
sysparams.c:3343: Test failed: 2/2: wrong desktop resolution (0,0)-(2048,768) expected (0,0)-(1024,768)
version
install.c:250: Test failed: Wrong return value got 0 expected VFF_CURNEDEST set
install.c:255: Test failed: Wrong return value got 0 expected VFF_CURNEDEST set
install.c:260: Test failed: Wrong return value got 0 expected VFF_CURNEDEST set
wininet
ftp.c:81: Test failed: Expected ERROR_INTERNET_LOGIN_FAILURE, got 12110
ftp.c:112: Test failed: InternetConnect failed : 12110
ftp.c:113: Test failed: ERROR_SUCCESS, got 12110
ftp.c:122: Test failed: Expected ERROR_INTERNET_LOGIN_FAILURE, got 12110
ftp: Timeout
http.c:6174: Test failed: req_error = 12045
http.c:6213: Test failed: Unexpected cert errors 12045, skipping security flags tests
http.c:4865: Test failed: expected 1 pending read, got 2
ws2_32
sock.c:3052: Test failed: Test[1]: expected 2, got 0
sock.c:3052: Test failed: Test[2]: expected 2, got 0
sock.c:3052: Test failed: Test[1]: expected 2, got 0
sock.c:3052: Test failed: Test[2]: expected 2, got 0
Report errors
d3d11:d3d11 prints too much data (35751 bytes)
dxgi:dxgi crashed (c0000005)
kernel32:virtual prints too much data (91050 bytes)
opengl32:opengl has no test summary line (early exit of the main process?)
opengl32:opengl has unaccounted for todo messages
opengl32:opengl has unaccounted for skip messages
user32:msg prints too much data (35219 bytes)
vulkan-1:vulkan had no start line (or it is garbled)
Task log
X Error of failed request:  BadValue (integer parameter out of range for operation)
  Major opcode of failed request:  53 (X_CreatePixmap)

debian10 (64 bit WoW tests)

Debian 10 / vm4Debian 10 configured for Wine. Runs fvwm with 2 screens. [CPU:4*host RAM:3GB disk:virtio-scsi eth:virtio snd:ich9 GPU:qxl display:spice testagentd:1.7]
Missions: wow64,test=module
64 bit WoW report
d3d10core
d3d10core.c:4773: Test failed: Got unexpected CPrimitives count: 3.
d3d10core.c:4787: Test failed: Got unexpected CPrimitives count: 3.
d3d10core.c:4970: Test succeeded inside todo block: Got unexpected PrimitivesStorageNeeded: 0.
d3d10core.c:4980: Test succeeded inside todo block: Got unexpected PrimitivesStorageNeeded: 0.
d3d10core.c:7479: Test failed: Test 52: Got unexpected color 0xff0000ff at (0, 0).
d3d10core.c:7479: Test failed: Test 52: Got unexpected color 0xff00ffff at (1, 0).
d3d10core.c:7479: Test failed: Test 52: Got unexpected color 0xff00ff00 at (2, 0).
d3d10core.c:7479: Test failed: Test 52: Got unexpected color 0xffffff00 at (3, 0).
d3d10core.c:7479: Test failed: Test 52: Got unexpected color 0xffff0000 at (0, 1).
d3d10core.c:7479: Test failed: Test 52: Got unexpected color 0xffff00ff at (1, 1).
d3d10core.c:7479: Test failed: Test 52: Got unexpected color 0xff000000 at (2, 1).
d3d10core.c:7479: Test failed: Test 52: Got unexpected color 0xff7f7f7f at (3, 1).
d3d10core.c:7479: Test failed: Test 52: Got unexpected color 0xffffffff at (0, 2).
d3d10core.c:7479: Test failed: Test 52: Got unexpected color 0xffffffff at (1, 2).
d3d10core.c:7479: Test failed: Test 52: Got unexpected color 0xffffffff at (2, 2).
d3d10core.c:7479: Test failed: Test 52: Got unexpected color 0xff000000 at (3, 2).
d3d10core.c:7479: Test failed: Test 52: Got unexpected color 0xffffffff at (0, 3).
d3d10core.c:7479: Test failed: Test 52: Got unexpected color 0xff000000 at (2, 3).
d3d10core.c:7479: Test failed: Test 52: Got unexpected color 0xff000000 at (3, 3).
d3d10core.c:12598: Test failed: Got {-1.00003052e+000, 0.00000000e+000, 1.00000000e+000, 0.00000000e+000}, expected {-1.00000000e+000, 0.00000000e+000, 1.00000000e+000, 0.00000000e+000} at (0, 0), sub-resource 0.
d3d10core.c:12958: Test failed: Got {0x00000000, 0x00000000, 0x00000000, 0x00000000}, expected {0x00000000, 0xffffffff, 0x00000000, 0x00000000} at (0, 0), sub-resource 0.
d3d10core.c:12958: Test failed: Got {0x00000000, 0x00000000, 0x00000000, 0x00000000}, expected {0xffffffff, 0x00000000, 0x00000000, 0x00000000} at (0, 0), sub-resource 0.
d3d10core.c:12958: Test failed: Got {0xffffffff, 0x00000001, 0x00000000, 0x00000000}, expected {0x00000000, 0x00000001, 0x00000000, 0x00000000} at (0, 0), sub-resource 0.
d3d10core.c:12958: Test failed: Got {0x00000001, 0xffffffff, 0x00000000, 0x00000000}, expected {0x00000001, 0x00000000, 0x00000000, 0x00000000} at (0, 0), sub-resource 0.
d3d10core.c:12598: Test failed: Got {-1.00787401e+000, 0.00000000e+000, 1.00000000e+000, 5.03937006e-001}, expected {-1.00000000e+000, 0.00000000e+000, 1.00000000e+000, 5.03937006e-001} at (0, 0), sub-resource 0.
d3d10core.c:16920: Test failed: Resource type 1, test 7: pixel (200, 200) has color 00000000, expected ffff0000.
d3d10core.c:16920: Test failed: Resource type 1, test 7: pixel (280, 200) has color 00000000, expected ffff0000.
d3d10core.c:16920: Test failed: Resource type 1, test 7: pixel (360, 200) has color 00000000, expected ff00ff00.
d3d10core.c:16920: Test failed: Resource type 1, test 7: pixel (440, 200) has color 00000000, expected ff00ff00.
d3d10core.c:16920: Test failed: Resource type 1, test 7: pixel (200, 270) has color 00000000, expected ff0000ff.
d3d10core.c:16920: Test failed: Resource type 1, test 7: pixel (280, 270) has color 00000000, expected ff0000ff.
d3d10core.c:16920: Test failed: Resource type 1, test 7: pixel (360, 270) has color 00000000, expected ff000000.
d3d10core.c:16920: Test failed: Resource type 1, test 7: pixel (440, 270) has color 00000000, expected ff000000.
d3d10core.c:16920: Test failed: Resource type 1, test 8: pixel (200, 200) has color 00000000, expected ffff0000.
d3d10core.c:16920: Test failed: Resource type 1, test 8: pixel (280, 200) has color 00000000, expected ffff0000.
d3d10core.c:16920: Test failed: Resource type 1, test 8: pixel (360, 200) has color 00000000, expected ff00ff00.
d3d10core.c:16920: Test failed: Resource type 1, test 8: pixel (440, 200) has color 00000000, expected ff00ff00.
d3d10core.c:16920: Test failed: Resource type 1, test 8: pixel (200, 270) has color 00000000, expected ff0000ff.
d3d10core.c:16920: Test failed: Resource type 1, test 8: pixel (280, 270) has color 00000000, expected ff0000ff.
d3d10core.c:16920: Test failed: Resource type 1, test 8: pixel (360, 270) has color 00000000, expected ff000000.
d3d10core.c:16920: Test failed: Resource type 1, test 8: pixel (440, 270) has color 00000000, expected ff000000.
d3d10core.c:16920: Test failed: Resource type 2, test 7: pixel (200, 200) has color 00000000, expected ffff0000.
d3d10core.c:16920: Test failed: Resource type 2, test 7: pixel (280, 200) has color 00000000, expected ffff0000.
d3d10core.c:16920: Test failed: Resource type 2, test 7: pixel (360, 200) has color 00000000, expected ff00ff00.
d3d10core.c:16920: Test failed: Resource type 2, test 7: pixel (440, 200) has color 00000000, expected ff00ff00.
d3d10core.c:16920: Test failed: Resource type 2, test 7: pixel (200, 270) has color 00000000, expected ff0000ff.
d3d10core.c:16920: Test failed: Resource type 2, test 7: pixel (280, 270) has color 00000000, expected ff0000ff.
d3d10core.c:16920: Test failed: Resource type 2, test 7: pixel (360, 270) has color 00000000, expected ff000000.
d3d10core.c:16920: Test failed: Resource type 2, test 7: pixel (440, 270) has color 00000000, expected ff000000.
d3d10core.c:16920: Test failed: Resource type 2, test 8: pixel (200, 200) has color 00000000, expected ffff0000.
d3d10core.c:16920: Test failed: Resource type 2, test 8: pixel (280, 200) has color 00000000, expected ffff0000.
d3d10core.c:16920: Test failed: Resource type 2, test 8: pixel (360, 200) has color 00000000, expected ff00ff00.
d3d10core.c:16920: Test failed: Resource type 2, test 8: pixel (440, 200) has color 00000000, expected ff00ff00.
d3d10core.c:16920: Test failed: Resource type 2, test 8: pixel (200, 270) has color 00000000, expected ff0000ff.
d3d10core.c:16920: Test failed: Resource type 2, test 8: pixel (280, 270) has color 00000000, expected ff0000ff.
d3d10core.c:16920: Test failed: Resource type 2, test 8: pixel (360, 270) has color 00000000, expected ff000000.
d3d10core.c:16920: Test failed: Resource type 2, test 8: pixel (440, 270) has color 00000000, expected ff000000.
d3d10core.c:16920: Test failed: Resource type 3, test 7: pixel (200, 200) has color 00000000, expected ffff0000.
d3d10core.c:16920: Test failed: Resource type 3, test 7: pixel (280, 200) has color 00000000, expected ffff0000.
d3d10core.c:16920: Test failed: Resource type 3, test 7: pixel (360, 200) has color 00000000, expected ff00ff00.
d3d10core.c:16920: Test failed: Resource type 3, test 7: pixel (440, 200) has color 00000000, expected ff00ff00.
d3d10core.c:16920: Test failed: Resource type 3, test 7: pixel (200, 270) has color 00000000, expected ff0000ff.
d3d10core.c:16920: Test failed: Resource type 3, test 7: pixel (280, 270) has color 00000000, expected ff0000ff.
d3d10core.c:16920: Test failed: Resource type 3, test 7: pixel (360, 270) has color 00000000, expected ff000000.
d3d10core.c:16920: Test failed: Resource type 3, test 7: pixel (440, 270) has color 00000000, expected ff000000.
d3d10core.c:16920: Test failed: Resource type 3, test 8: pixel (200, 200) has color 00000000, expected ffff0000.
d3d10core.c:16920: Test failed: Resource type 3, test 8: pixel (280, 200) has color 00000000, expected ffff0000.
d3d10core.c:16920: Test failed: Resource type 3, test 8: pixel (360, 200) has color 00000000, expected ff00ff00.
d3d10core.c:16920: Test failed: Resource type 3, test 8: pixel (440, 200) has color 00000000, expected ff00ff00.
d3d10core.c:16920: Test failed: Resource type 3, test 8: pixel (200, 270) has color 00000000, expected ff0000ff.
d3d10core.c:16920: Test failed: Resource type 3, test 8: pixel (280, 270) has color 00000000, expected ff0000ff.
d3d10core.c:16920: Test failed: Resource type 3, test 8: pixel (360, 270) has color 00000000, expected ff000000.
d3d10core.c:16920: Test failed: Resource type 3, test 8: pixel (440, 270) has color 00000000, expected ff000000.
d3d10core.c:15852: Test failed: Got depth 2.51951814e-003, expected 2.51948950e-003.
d3d10core.c:15852: Test failed: Got depth 2.51951814e-003, expected 2.51948950e-003.
d3d10core.c:15852: Test failed: Got depth 1.27950311e-003, expected 1.27948953e-003.
d3d10core.c:15852: Test failed: Got depth 1.27950311e-003, expected 1.27948953e-003.
d3d10core.c:15852: Test failed: Got depth 1.27950311e-003, expected 1.27948953e-003.
d3d10core.c:15852: Test failed: Got depth 1.27950311e-003, expected 1.27948953e-003.
d3d10core.c:15852: Test failed: Got depth 1.27950311e-003, expected 1.27948953e-003.
d3d10core.c:15852: Test failed: Got depth 1.27950311e-003, expected 1.27948953e-003.
d3d10core.c:15852: Test failed: Got depth 5.03277779e-003, expected 5.03897900e-003.
d3d10core.c:15852: Test failed: Got depth 5.03277779e-003, expected 5.03897900e-003.
d3d10core.c:15852: Test failed: Got depth 2.54905224e-003, expected 2.54897905e-003.
d3d10core.c:15852: Test failed: Got depth 7.52645731e-003, expected 7.53897894e-003.
d3d10core.c:15852: Test failed: Got depth 7.52645731e-003, expected 7.53897894e-003.
d3d10core.c:15852: Test failed: Got depth 2.54905224e-003, expected 2.54897905e-003.
d3d10core.c:15852: Test failed: Got depth 1.25139356e-002, expected 1.25389788e-002.
d3d10core.c:15852: Test failed: Got depth 1.25139356e-002, expected 1.25389788e-002.
d3d10core.c:15852: Test failed: Got depth 2.54905224e-003, expected 2.54897905e-003.
d3d10core.c:15852: Test failed: Got depth 6.40938997e-001, expected 6.42538965e-001.
d3d10core.c:15852: Test failed: Got depth 6.40938997e-001, expected 6.42538965e-001.
d3d10core.c:15852: Test failed: Got depth 2.54905224e-003, expected 2.54897905e-003.
d3d10core.c:15852: Test failed: Got depth 2.54905224e-003, expected 2.54897905e-003.
d3d10core.c:15852: Test failed: Got depth 2.54905224e-003, expected 2.54897905e-003.
d3d10core.c:15860: Test failed: Got value 0x149d4 (5.03277809e-003), expected 0x14a3c (5.03897697e-003).
d3d10core.c:15860: Test failed: Got value 0x149d4 (5.03277809e-003), expected 0x14a3c (5.03897697e-003).
d3d10core.c:15860: Test failed: Got value 0x5c5c2 (2.25487961e-002), expected 0x5c5c6 (2.25490345e-002).
d3d10core.c:15860: Test failed: Got value 0x1ed41 (7.52645776e-003), expected 0x1ee13 (7.53897473e-003).
d3d10core.c:15860: Test failed: Got value 0x1ed41 (7.52645776e-003), expected 0x1ee13 (7.53897473e-003).
d3d10core.c:15860: Test failed: Got value 0x5c5c2 (2.25487961e-002), expected 0x5c5c6 (2.25490345e-002).
d3d10core.c:15860: Test failed: Got value 0x3341d (1.25139363e-002), expected 0x335c1 (1.25389703e-002).
d3d10core.c:15860: Test failed: Got value 0x3341d (1.25139363e-002), expected 0x335c1 (1.25389703e-002).
d3d10core.c:15860: Test failed: Got value 0x5c5c2 (2.25487961e-002), expected 0x5c5c6 (2.25490345e-002).
d3d10core.c:15860: Test failed: Got value 0xa41493 (6.40938976e-001), expected 0xa47d6e (6.42538943e-001).
d3d10core.c:15860: Test failed: Got value 0xa41493 (6.40938976e-001), expected 0xa47d6e (6.42538943e-001).
d3d10core.c:15860: Test failed: Got value 0x5c5c2 (2.25487961e-002), expected 0x5c5c6 (2.25490345e-002).
d3d10core.c:15860: Test failed: Got value 0x5c5c2 (2.25487961e-002), expected 0x5c5c6 (2.25490345e-002).
d3d10core.c:15860: Test failed: Got value 0x5c5c2 (2.25487961e-002), expected 0x5c5c6 (2.25490345e-002).
d3d10core.c:15869: Test failed: Got value 0x3d8 (1.50148775e-002), expected 0x3da (1.50453956e-002).
d3d10core.c:15869: Test failed: Got value 0x3d8 (1.50148775e-002), expected 0x3da (1.50453956e-002).
d3d10core.c:15869: Test failed: Got value 0x333 (1.24971389e-002), expected 0x336 (1.25429160e-002).
d3d10core.c:15869: Test failed: Got value 0x333 (1.24971389e-002), expected 0x336 (1.25429160e-002).
d3d10core.c:15869: Test failed: Got value 0x479 (1.74715801e-002), expected 0x47d (1.75326162e-002).
d3d10core.c:15869: Test failed: Got value 0x479 (1.74715801e-002), expected 0x47d (1.75326162e-002).
d3d10core.c:15869: Test failed: Got value 0xa414 (6.40939956e-001), expected 0xa47c (6.42526894e-001).
d3d10core.c:15869: Test failed: Got value 0xa414 (6.40939956e-001), expected 0xa47c (6.42526894e-001).
d3d11
d3d11.c:5782: Test failed: Got unexpected CPrimitives count: 3.
d3d11.c:5785: Test failed: Got unexpected HSInvocations count: 4.
d3d11.c:5786: Test failed: Got unexpected DSInvocations count: 4.
d3d11.c:5787: Test failed: Got unexpected CSInvocations count: 311040.
d3d11.c:6109: Test succeeded inside todo block: Got unexpected PrimitivesStorageNeeded: 0.
d3d11.c:5799: Test failed: Got unexpected CPrimitives count: 3.
d3d11.c:5801: Test failed: Got unexpected HSInvocations count: 4.
d3d11.c:5802: Test failed: Got unexpected DSInvocations count: 4.
d3d11.c:5803: Test failed: Got unexpected CSInvocations count: 311040.
d3d11.c:6119: Test succeeded inside todo block: Got unexpected PrimitivesStorageNeeded: 0.
d3d11.c:8316: Test failed: Test 60: Got unexpected color 0xff0000ff at (0, 0).
d3d11.c:8316: Test failed: Test 60: Got unexpected color 0xff00ffff at (1, 0).
d3d11.c:8316: Test failed: Test 60: Got unexpected color 0xff00ff00 at (2, 0).
d3d11.c:8316: Test failed: Test 60: Got unexpected color 0xffffff00 at (3, 0).
d3d11.c:8316: Test failed: Test 60: Got unexpected color 0xffff0000 at (0, 1).
d3d11.c:8316: Test failed: Test 60: Got unexpected color 0xffff00ff at (1, 1).
d3d11.c:8316: Test failed: Test 60: Got unexpected color 0xff000000 at (2, 1).
d3d11.c:8316: Test failed: Test 60: Got unexpected color 0xff7f7f7f at (3, 1).
d3d11.c:8316: Test failed: Test 60: Got unexpected color 0xffffffff at (0, 2).
d3d11.c:8316: Test failed: Test 60: Got unexpected color 0xffffffff at (1, 2).
d3d11.c:8316: Test failed: Test 60: Got unexpected color 0xffffffff at (2, 2).
d3d11.c:8316: Test failed: Test 60: Got unexpected color 0xff000000 at (3, 2).
d3d11.c:8316: Test failed: Test 60: Got unexpected color 0xffffffff at (0, 3).
d3d11.c:8316: Test failed: Test 60: Got unexpected color 0xff000000 at (2, 3).
d3d11.c:8316: Test failed: Test 60: Got unexpected color 0xff000000 at (3, 3).
d3d11.c:16860: Test failed: Got {-1.00003052e+000, 0.00000000e+000, 1.00000000e+000, 0.00000000e+000}, expected {-1.00000000e+000, 0.00000000e+000, 1.00000000e+000, 0.00000000e+000} at (0, 0), sub-resource 0.
d3d11.c:17958: Test failed: Got {0x00000000, 0x00000000, 0x00000000, 0x00000000}, expected {0x00000000, 0xffffffff, 0x00000000, 0x00000000} at (0, 0), sub-resource 0.
d3d11.c:17958: Test failed: Got {0x00000000, 0x00000000, 0x00000000, 0x00000000}, expected {0xffffffff, 0x00000000, 0x00000000, 0x00000000} at (0, 0), sub-resource 0.
d3d11.c:17958: Test failed: Got {0xffffffff, 0x00000001, 0x00000000, 0x00000000}, expected {0x00000000, 0x00000001, 0x00000000, 0x00000000} at (0, 0), sub-resource 0.
d3d11.c:17958: Test failed: Got {0x00000001, 0xffffffff, 0x00000000, 0x00000000}, expected {0x00000001, 0x00000000, 0x00000000, 0x00000000} at (0, 0), sub-resource 0.
d3d11.c:16860: Test failed: Got {-1.00787401e+000, 0.00000000e+000, 1.00000000e+000, 5.03937006e-001}, expected {-1.00000000e+000, 0.00000000e+000, 1.00000000e+000, 5.03937006e-001} at (0, 0), sub-resource 0.
d3d11.c:27602: Test failed: Resource type 1, test 7: pixel (200, 200) has color 00000000, expected ffff0000.
d3d11.c:27602: Test failed: Resource type 1, test 7: pixel (280, 200) has color 00000000, expected ffff0000.
d3d11.c:27602: Test failed: Resource type 1, test 7: pixel (360, 200) has color 00000000, expected ff00ff00.
d3d11.c:27602: Test failed: Resource type 1, test 7: pixel (440, 200) has color 00000000, expected ff00ff00.
d3d11.c:27602: Test failed: Resource type 1, test 7: pixel (200, 270) has color 00000000, expected ff0000ff.
d3d11.c:27602: Test failed: Resource type 1, test 7: pixel (280, 270) has color 00000000, expected ff0000ff.
d3d11.c:27602: Test failed: Resource type 1, test 7: pixel (360, 270) has color 00000000, expected ff000000.
d3d11.c:27602: Test failed: Resource type 1, test 7: pixel (440, 270) has color 00000000, expected ff000000.
d3d11.c:27602: Test failed: Resource type 1, test 8: pixel (200, 200) has color 00000000, expected ffff0000.
d3d11.c:27602: Test failed: Resource type 1, test 8: pixel (280, 200) has color 00000000, expected ffff0000.
d3d11.c:27602: Test failed: Resource type 1, test 8: pixel (360, 200) has color 00000000, expected ff00ff00.
d3d11.c:27602: Test failed: Resource type 1, test 8: pixel (440, 200) has color 00000000, expected ff00ff00.
d3d11.c:27602: Test failed: Resource type 1, test 8: pixel (200, 270) has color 00000000, expected ff0000ff.
d3d11.c:27602: Test failed: Resource type 1, test 8: pixel (280, 270) has color 00000000, expected ff0000ff.
d3d11.c:27602: Test failed: Resource type 1, test 8: pixel (360, 270) has color 00000000, expected ff000000.
d3d11.c:27602: Test failed: Resource type 1, test 8: pixel (440, 270) has color 00000000, expected ff000000.
d3d11.c:27602: Test failed: Resource type 2, test 7: pixel (200, 200) has color 00000000, expected ffff0000.
d3d11.c:27602: Test failed: Resource type 2, test 7: pixel (280, 200) has color 00000000, expected ffff0000.
d3d11.c:27602: Test failed: Resource type 2, test 7: pixel (360, 200) has color 00000000, expected ff00ff00.
d3d11.c:27602: Test failed: Resource type 2, test 7: pixel (440, 200) has color 00000000, expected ff00ff00.
d3d11.c:27602: Test failed: Resource type 2, test 7: pixel (200, 270) has color 00000000, expected ff0000ff.
d3d11.c:27602: Test failed: Resource type 2, test 7: pixel (280, 270) has color 00000000, expected ff0000ff.
d3d11.c:27602: Test failed: Resource type 2, test 7: pixel (360, 270) has color 00000000, expected ff000000.
d3d11.c:27602: Test failed: Resource type 2, test 7: pixel (440, 270) has color 00000000, expected ff000000.
d3d11.c:27602: Test failed: Resource type 2, test 8: pixel (200, 200) has color 00000000, expected ffff0000.
d3d11.c:27602: Test failed: Resource type 2, test 8: pixel (280, 200) has color 00000000, expected ffff0000.
d3d11.c:27602: Test failed: Resource type 2, test 8: pixel (360, 200) has color 00000000, expected ff00ff00.
d3d11.c:27602: Test failed: Resource type 2, test 8: pixel (440, 200) has color 00000000, expected ff00ff00.
d3d11.c:27602: Test failed: Resource type 2, test 8: pixel (200, 270) has color 00000000, expected ff0000ff.
d3d11.c:27602: Test failed: Resource type 2, test 8: pixel (280, 270) has color 00000000, expected ff0000ff.
d3d11.c:27602: Test failed: Resource type 2, test 8: pixel (360, 270) has color 00000000, expected ff000000.
d3d11.c:27602: Test failed: Resource type 2, test 8: pixel (440, 270) has color 00000000, expected ff000000.
d3d11.c:27602: Test failed: Resource type 3, test 7: pixel (200, 200) has color 00000000, expected ffff0000.
d3d11.c:27602: Test failed: Resource type 3, test 7: pixel (280, 200) has color 00000000, expected ffff0000.
d3d11.c:27602: Test failed: Resource type 3, test 7: pixel (360, 200) has color 00000000, expected ff00ff00.
d3d11.c:27602: Test failed: Resource type 3, test 7: pixel (440, 200) has color 00000000, expected ff00ff00.
d3d11.c:27602: Test failed: Resource type 3, test 7: pixel (200, 270) has color 00000000, expected ff0000ff.
d3d11.c:27602: Test failed: Resource type 3, test 7: pixel (280, 270) has color 00000000, expected ff0000ff.
d3d11.c:27602: Test failed: Resource type 3, test 7: pixel (360, 270) has color 00000000, expected ff000000.
d3d11.c:27602: Test failed: Resource type 3, test 7: pixel (440, 270) has color 00000000, expected ff000000.
d3d11.c:27602: Test failed: Resource type 3, test 8: pixel (200, 200) has color 00000000, expected ffff0000.
d3d11.c:27602: Test failed: Resource type 3, test 8: pixel (280, 200) has color 00000000, expected ffff0000.
d3d11.c:27602: Test failed: Resource type 3, test 8: pixel (360, 200) has color 00000000, expected ff00ff00.
d3d11.c:27602: Test failed: Resource type 3, test 8: pixel (440, 200) has color 00000000, expected ff00ff00.
d3d11.c:27602: Test failed: Resource type 3, test 8: pixel (200, 270) has color 00000000, expected ff0000ff.
d3d11.c:27602: Test failed: Resource type 3, test 8: pixel (280, 270) has color 00000000, expected ff0000ff.
d3d11.c:27602: Test failed: Resource type 3, test 8: pixel (360, 270) has color 00000000, expected ff000000.
d3d11.c:27602: Test failed: Resource type 3, test 8: pixel (440, 270) has color 00000000, expected ff000000.
d3d11.c:25838: Test failed: Got depth 2.51951814e-003, expected 2.51948950e-003.
d3d11.c:25838: Test failed: Got depth 2.51951814e-003, expected 2.51948950e-003.
d3d11.c:25838: Test failed: Got depth 1.27950311e-003, expected 1.27948953e-003.
d3d11.c:25838: Test failed: Got depth 1.27950311e-003, expected 1.27948953e-003.
d3d11.c:25838: Test failed: Got depth 1.27950311e-003, expected 1.27948953e-003.
d3d11.c:25838: Test failed: Got depth 1.27950311e-003, expected 1.27948953e-003.
d3d11.c:25838: Test failed: Got depth 1.27950311e-003, expected 1.27948953e-003.
d3d11.c:25838: Test failed: Got depth 1.27950311e-003, expected 1.27948953e-003.
d3d11.c:25838: Test failed: Got depth 5.03277779e-003, expected 5.03897900e-003.
d3d11.c:25838: Test failed: Got depth 5.03277779e-003, expected 5.03897900e-003.
d3d11.c:25838: Test failed: Got depth 2.54905224e-003, expected 2.54897905e-003.
d3d11.c:25838: Test failed: Got depth 7.52645731e-003, expected 7.53897894e-003.
d3d11.c:25838: Test failed: Got depth 7.52645731e-003, expected 7.53897894e-003.
d3d11.c:25838: Test failed: Got depth 2.54905224e-003, expected 2.54897905e-003.
d3d11.c:25838: Test failed: Got depth 1.25139356e-002, expected 1.25389788e-002.
d3d11.c:25838: Test failed: Got depth 1.25139356e-002, expected 1.25389788e-002.
d3d11.c:25838: Test failed: Got depth 2.54905224e-003, expected 2.54897905e-003.
d3d11.c:25838: Test failed: Got depth 6.40938997e-001, expected 6.42538965e-001.
d3d11.c:25838: Test failed: Got depth 6.40938997e-001, expected 6.42538965e-001.
d3d11.c:25838: Test failed: Got depth 2.54905224e-003, expected 2.54897905e-003.
d3d11.c:25838: Test failed: Got depth 2.54905224e-003, expected 2.54897905e-003.
d3d11.c:25838: Test failed: Got depth 2.54905224e-003, expected 2.54897905e-003.
d3d11.c:25846: Test failed: Got value 0x149d4 (5.03277809e-003), expected 0x14a3c (5.03897697e-003).
d3d11.c:25846: Test failed: Got value 0x149d4 (5.03277809e-003), expected 0x14a3c (5.03897697e-003).
d3d11.c:25846: Test failed: Got value 0x5c5c2 (2.25487961e-002), expected 0x5c5c6 (2.25490345e-002).
d3d11.c:25846: Test failed: Got value 0x1ed41 (7.52645776e-003), expected 0x1ee13 (7.53897473e-003).
d3d11.c:25846: Test failed: Got value 0x1ed41 (7.52645776e-003), expected 0x1ee13 (7.53897473e-003).
d3d11.c:25846: Test failed: Got value 0x5c5c2 (2.25487961e-002), expected 0x5c5c6 (2.25490345e-002).
d3d11.c:25846: Test failed: Got value 0x3341d (1.25139363e-002), expected 0x335c1 (1.25389703e-002).
d3d11.c:25846: Test failed: Got value 0x3341d (1.25139363e-002), expected 0x335c1 (1.25389703e-002).
d3d11.c:25846: Test failed: Got value 0x5c5c2 (2.25487961e-002), expected 0x5c5c6 (2.25490345e-002).
d3d11.c:25846: Test failed: Got value 0xa41493 (6.40938976e-001), expected 0xa47d6e (6.42538943e-001).
d3d11.c:25846: Test failed: Got value 0xa41493 (6.40938976e-001), expected 0xa47d6e (6.42538943e-001).
d3d11.c:25846: Test failed: Got value 0x5c5c2 (2.25487961e-002), expected 0x5c5c6 (2.25490345e-002).
d3d11.c:25846: Test failed: Got value 0x5c5c2 (2.25487961e-002), expected 0x5c5c6 (2.25490345e-002).
d3d11.c:25846: Test failed: Got value 0x5c5c2 (2.25487961e-002), expected 0x5c5c6 (2.25490345e-002).
d3d11.c:25855: Test failed: Got value 0x3d8 (1.50148775e-002), expected 0x3da (1.50453956e-002).
d3d11.c:25855: Test failed: Got value 0x3d8 (1.50148775e-002), expected 0x3da (1.50453956e-002).
d3d11.c:25855: Test failed: Got value 0x333 (1.24971389e-002), expected 0x336 (1.25429160e-002).
d3d11.c:25855: Test failed: Got value 0x333 (1.24971389e-002), expected 0x336 (1.25429160e-002).
d3d11.c:25855: Test failed: Got value 0x479 (1.74715801e-002), expected 0x47d (1.75326162e-002).
d3d11.c:25855: Test failed: Got value 0x479 (1.74715801e-002), expected 0x47d (1.75326162e-002).
d3d11.c:25855: Test failed: Got value 0xa414 (6.40939956e-001), expected 0xa47c (6.42526894e-001).
d3d11.c:25855: Test failed: Got value 0xa414 (6.40939956e-001), expected 0xa47c (6.42526894e-001).
d3d8
device.c:3165: Test failed: Expected message 0x1c for window 0x1, but didn't receive it
visual.c:6623: Test failed: Expected color 0x00000000, got 0x000000ff, format D3DFMT_Q8W8V8U8, test 0, location 3x2.
visual.c:6623: Test failed: Expected color 0x00000000, got 0x000000ff, format D3DFMT_Q8W8V8U8, test 2, location 3x2.
visual.c:7464: Test failed: Got unexpected color 0x0000ff00 (case 0, 3, size 0).
visual.c:7464: Test failed: Got unexpected color 0x0000ff00 (case 1, 3, size 0).
visual.c:7464: Test failed: Got unexpected color 0x0000ff00 (case 2, 3, size 0).
visual.c:7464: Test failed: Got unexpected color 0x0000ff00 (case 3, 3, size 0).
visual.c:7464: Test failed: Got unexpected color 0x0000ff00 (case 4, 7, size 0).
visual.c:7464: Test failed: Got unexpected color 0x0000ff00 (case 5, 7, size 0).
visual.c:8791: Test failed: Test 0 shading has color1 000000ff, expected 0000ff00.
visual.c:8791: Test failed: Test 6 shading has color1 000000ff, expected 0000ff00.
visual.c:8791: Test failed: Test 10 shading has color1 000000ff, expected 0000ff00.
visual.c:8791: Test failed: Test 11 shading has color1 000000ff, expected 0000ff00.
visual.c:10297: Test failed: Expected unsynchronised map for flags 0x1000.
visual.c:10297: Test failed: Expected unsynchronised map for flags 0x3000.
d3d9
device.c:4624: Test failed: Received unexpected WM_SIZE message.
device.c:6094: Test failed: Got unexpected hr 0x1.
device.c:6098: Test failed: Got unexpected hr 0x1.
device.c:6099: Test failed: Got unexpected query result 0xffffffffffffffff.
device: Timeout
visual.c:9410: Test failed: Test 0 shading has color1 000000ff, expected 0000ff00.
visual.c:9410: Test failed: Test 6 shading has color1 000000ff, expected 0000ff00.
visual.c:9410: Test failed: Test 10 shading has color1 000000ff, expected 0000ff00.
visual.c:9410: Test failed: Test 11 shading has color1 000000ff, expected 0000ff00.
visual.c:9410: Test failed: Test 12 shading has color1 000000ff, expected 0000ff00.
visual.c:11972: Test failed: Got unexpected color 0x0000ff00 (case 0, 3, size 0).
visual.c:11972: Test failed: Got unexpected color 0x0000ff00 (case 1, 3, size 0).
visual.c:11972: Test failed: Got unexpected color 0x0000ff00 (case 2, 3, size 0).
visual.c:11972: Test failed: Got unexpected color 0x0000ff00 (case 3, 3, size 0).
visual.c:11972: Test failed: Got unexpected color 0x0000ff00 (case 4, 3, size 0).
visual.c:11972: Test failed: Got unexpected color 0x00ff0000 (case 5, 3, size 0).
visual.c:11972: Test failed: Got unexpected color 0x0000ff00 (case 6, 3, size 0).
visual.c:11972: Test failed: Got unexpected color 0x00ff0000 (case 7, 3, size 0).
visual.c:11972: Test failed: Got unexpected color 0x0000ff00 (case 8, 3, size 0).
visual.c:11972: Test failed: Got unexpected color 0x00ff0000 (case 9, 3, size 0).
visual.c:11972: Test failed: Got unexpected color 0x0000ff00 (case 10, 7, size 0).
visual.c:11972: Test failed: Got unexpected color 0x0000ff00 (case 11, 7, size 0).
visual.c:11972: Test failed: Got unexpected color 0x0000ff00 (case 12, 7, size 0).
visual.c:20801: Test failed: Expected color 0x00000000, got 0x000000ff, format D3DFMT_Q8W8V8U8, test 0, location 3x2.
visual.c:20801: Test failed: Expected color 0x00000000, got 0x000000ff, format D3DFMT_Q8W8V8U8, test 2, location 3x2.
visual.c:22064: Test failed: Got unexpected color 00ffffff at x=64, format 80.
visual.c:22071: Test failed: Got unexpected color 000000ff at x=194, format 80.
visual.c:22081: Test failed: Got unexpected color 00000000 at x=446, format 80.
visual.c:22064: Test failed: Got unexpected color 00ffffff at x=64, format 77.
visual.c:22071: Test failed: Got unexpected color 000000ff at x=194, format 77.
visual.c:22081: Test failed: Got unexpected color 00000000 at x=446, format 77.
visual.c:22064: Test failed: Got unexpected color 00ffffff at x=64, format 75.
visual.c:22071: Test failed: Got unexpected color 000000ff at x=194, format 75.
visual.c:22081: Test failed: Got unexpected color 00000000 at x=446, format 75.
visual.c:22064: Test failed: Got unexpected color 00ffffff at x=64, format 1515474505.
visual.c:22071: Test failed: Got unexpected color 000000ff at x=194, format 1515474505.
visual.c:22081: Test failed: Got unexpected color 00000000 at x=446, format 1515474505.
visual.c:25211: Test failed: Expected unsynchronised map for flags 0x1000.
visual.c:25211: Test failed: Expected unsynchronised map for flags 0x3000.
ddraw
ddraw2.c:9700: Test failed: Test 0 shading has color1 000000ff, expected 0000ff00.
ddraw4.c:11476: Test failed: Test 0 shading has color1 000000ff, expected 0000ff00.
ddraw7.c:11485: Test failed: Test 0 shading has color1 000000ff, expected 0000ff00.
ddraw7.c:14422: Test failed: Expected unsynchronised map for flags 0x1000.
ddraw7.c:14422: Test failed: Expected unsynchronised map for flags 0x3000.
dinput
dinput.c:405: Test failed: guidProduct.Data2 is 7734
dinput.c:407: Test failed: guidProduct.Data3 is 11d2
dinput.c:409: Test failed: guidProduct.Data4 does not match: {9e573ed9-7734-11d2-8d4a-23903fb6bdf7}
dinput.c:405: Test failed: guidProduct.Data2 is 7734
dinput.c:407: Test failed: guidProduct.Data3 is 11d2
dinput.c:409: Test failed: guidProduct.Data4 does not match: {9e573ed9-7734-11d2-8d4a-23903fb6bdf7}
joystick.c:405: Test failed: IDirectInput_GetProperty() for DIPROP_GUIDANDPATH failed: 80004001
joystick.c:416: Test failed: DIPROP_GUIDANDPATH path has wrong format. Expected count: 2 Got: -1 Path: L""
joystick.c:418: Test failed: DIPROP_GUIDANDPATH path should contain either 'ig_' or 'mi_' substring. Path: L""
joystick.c:405: Test failed: IDirectInput_GetProperty() for DIPROP_GUIDANDPATH failed: 80004001
joystick.c:416: Test failed: DIPROP_GUIDANDPATH path has wrong format. Expected count: 2 Got: -1 Path: L""
joystick.c:418: Test failed: DIPROP_GUIDANDPATH path should contain either 'ig_' or 'mi_' substring. Path: L""
joystick.c:405: Test failed: IDirectInput_GetProperty() for DIPROP_GUIDANDPATH failed: 80004001
joystick.c:416: Test failed: DIPROP_GUIDANDPATH path has wrong format. Expected count: 2 Got: -1 Path: L""
joystick.c:418: Test failed: DIPROP_GUIDANDPATH path should contain either 'ig_' or 'mi_' substring. Path: L""
mouse.c:152: Test failed: Failed: 00000001
mouse.c:158: Test failed: Failed: 80070005
mouse.c:161: Test failed: Failed: 00000001
mouse.c:164: Test failed: Failed: 80070005
mouse.c:178: Test failed: GetDeviceData() failed: 00000000 cnt:0
dxgi
dxgi.c:2116: Test failed: Failed to get containing output, hr 0x887a0002.
Unhandled exception: page fault on execute access to 0x45455246 in 32-bit code (0x45455246).
gdi32
driver.c:81: Test failed: Got unexpected return code 0xc0000001.
driver.c:93: Test failed: Got unexpected value 0.
driver.c:97: Test failed: Got unexpected return code 0xc000000d.
kernel32
Unhandled exception: page fault on write access to 0x00000000 in 32-bit code (0x00439de2).
debugger.c:320: Test failed: GetThreadContext failed: 5
mmdevapi
render.c:1349: Test failed: Activation failed with 8889000a
render.c:1880: Test failed: Activation failed with 8889000a
mstask
task_scheduler.c:498: Test failed: got 0x80070020
ole32
clipboard.c:1049: Test failed: OleIsCurrentClipboard returned 0
clipboard.c:1117: Test failed: 1 WM_DRAWCLIPBOARD received
rsaenh
rsaenh.c:2391: Test failed: 8009000d
services.exe
service.c:422: Test failed: service: Unexpected monitor rcMonitor values: {1024,0,2048,739}
service.c:422: Test failed: service: Unexpected monitor rcWork values: {1024,0,2048,739}
service.c:422: Test failed: service: Unexpected szDevice received: \\.\DISPLAY2
service.c:422: Test failed: service: Unexpected secondary monitor info.
service.c:422: Test failed: service: Callback got called less or more than once. 2
urlmon
protocol.c:3656: Test failed: wait timed out
protocol: Timeout
url: Timeout
user32
msg.c:5148: Test succeeded inside todo block: ShowWindow(SW_SHOWMINIMIZED):overlapped: marked "todo_wine" but succeeds
sysparams.c:3251: Test failed: 0: wrong virt desktop rect (0,0)-(2048,768) expected (0,0)-(1024,768)
sysparams.c:3265: Test failed: 0: wrong caps virt desktop rect (0,0)-(2048,768) expected (0,0)-(1024,768)
sysparams.c:3251: Test failed: 1: wrong virt desktop rect (0,0)-(2048,768) expected (0,0)-(1024,768)
sysparams.c:3265: Test failed: 1: wrong caps virt desktop rect (0,0)-(2048,768) expected (0,0)-(1024,768)
sysparams.c:3251: Test failed: 2: wrong virt desktop rect (0,0)-(2048,768) expected (0,0)-(1024,768)
sysparams.c:3265: Test failed: 2: wrong caps virt desktop rect (0,0)-(2048,768) expected (0,0)-(1024,768)
sysparams.c:3343: Test failed: 0/0: wrong desktop resolution (0,0)-(2048,768) expected (0,0)-(1024,768)
sysparams.c:3343: Test failed: 0/1: wrong desktop resolution (0,0)-(2048,768) expected (0,0)-(1024,768)
sysparams.c:3343: Test failed: 0/2: wrong desktop resolution (0,0)-(2048,768) expected (0,0)-(1024,768)
sysparams.c:3343: Test failed: 1/0: wrong desktop resolution (0,0)-(2048,768) expected (0,0)-(1024,768)
sysparams.c:3343: Test failed: 1/1: wrong desktop resolution (0,0)-(2048,768) expected (0,0)-(1024,768)
sysparams.c:3343: Test failed: 1/2: wrong desktop resolution (0,0)-(2048,768) expected (0,0)-(1024,768)
sysparams.c:3343: Test failed: 2/0: wrong desktop resolution (0,0)-(2048,768) expected (0,0)-(1024,768)
sysparams.c:3343: Test failed: 2/1: wrong desktop resolution (0,0)-(2048,768) expected (0,0)-(1024,768)
sysparams.c:3343: Test failed: 2/2: wrong desktop resolution (0,0)-(2048,768) expected (0,0)-(1024,768)
version
install.c:250: Test failed: Wrong return value got 0 expected VFF_CURNEDEST set
install.c:255: Test failed: Wrong return value got 0 expected VFF_CURNEDEST set
install.c:260: Test failed: Wrong return value got 0 expected VFF_CURNEDEST set
wininet
ftp.c:81: Test failed: Expected ERROR_INTERNET_LOGIN_FAILURE, got 12110
ftp.c:112: Test failed: InternetConnect failed : 12110
ftp.c:113: Test failed: ERROR_SUCCESS, got 12110
ftp.c:122: Test failed: Expected ERROR_INTERNET_LOGIN_FAILURE, got 12110
ftp: Timeout
http.c:6174: Test failed: req_error = 12045
http.c:6213: Test failed: Unexpected cert errors 12045, skipping security flags tests
http.c:4777: Test failed: expected 1 pending read, got 2
ws2_32
sock.c:3052: Test failed: Test[1]: expected 2, got 0
sock.c:3052: Test failed: Test[2]: expected 2, got 0
sock.c:3052: Test failed: Test[1]: expected 2, got 0
sock.c:3052: Test failed: Test[2]: expected 2, got 0
Report errors
d3d11:d3d11 prints too much data (35751 bytes)
dxgi:dxgi crashed (c0000005)
kernel32:virtual prints too much data (91050 bytes)
opengl32:opengl has no test summary line (early exit of the main process?)
opengl32:opengl has unaccounted for todo messages
opengl32:opengl has unaccounted for skip messages
user32:msg prints too much data (35219 bytes)
vulkan-1:vulkan had no start line (or it is garbled)
Task log
X Error of failed request:  BadValue (integer parameter out of range for operation)
  Major opcode of failed request:  53 (X_CreatePixmap)