Wine Test Bot
    

Job 50926 - comtest

Step no Task no Status VM Timeout File name Arguments / Missions Execution started Time Number of test failures
1 1 badbuild build 60 diff 32 & 64 bit build 3s
2 1 skipped wxppro 120 mscoree_test.exe comtest  
2 2 skipped w2003std 120 mscoree_test.exe comtest  
2 3 skipped wvistau64 120 mscoree_test.exe comtest  
2 4 skipped wvistau64_zh_CN 120 mscoree_test.exe comtest  
2 5 skipped wvistau64_fr 120 mscoree_test.exe comtest  
2 6 skipped wvistau64_he 120 mscoree_test.exe comtest  
2 7 skipped w2008s64 120 mscoree_test.exe comtest  
2 8 skipped w7u 120 mscoree_test.exe comtest  
2 9 skipped w7pro64 120 mscoree_test.exe comtest  
2 10 skipped w8 120 mscoree_test.exe comtest  
2 11 skipped w8adm 120 mscoree_test.exe comtest  
2 12 skipped w864 120 mscoree_test.exe comtest  
2 13 skipped w1064 120 mscoree_test.exe comtest  
3 1 skipped wvistau64 120 mscoree_test64.exe comtest  
3 2 skipped wvistau64_zh_CN 120 mscoree_test64.exe comtest  
3 3 skipped wvistau64_fr 120 mscoree_test64.exe comtest  
3 4 skipped wvistau64_he 120 mscoree_test64.exe comtest  
3 5 skipped w2008s64 120 mscoree_test64.exe comtest  
3 6 skipped w7pro64 120 mscoree_test64.exe comtest  
3 7 skipped w864 120 mscoree_test64.exe comtest  
3 8 skipped w1064 120 mscoree_test64.exe comtest  

build (build)

Build VM / vm3Debian 9.4 and MinGW. [CPU:4*host RAM:768MB disk:virtio-scsi eth:virtio snd:none GPU:qxl display:spice testagentd:1.6]
Missions: exe32:exe64
../../../../wine/dlls/mscoree/tests/comtest.c:173:5: error: expected ‘=’, ‘,’, ‘;’, ‘asm’ or ‘__attribute__’ before ‘_AppDomain’
../../../../wine/dlls/mscoree/tests/comtest.c:210:57: error: ‘domain’ undeclared (first use in this function)
../../../../wine/dlls/mscoree/tests/comtest.c:220:20: error: ‘_AppDomain {aka struct _AppDomain}’ has no member named ‘Load’
../../../../wine/dlls/mscoree/tests/comtest.c:224:15: error: ‘_AppDomain {aka struct _AppDomain}’ has no member named ‘Release’
Makefile:173: recipe for target 'comtest.o' failed
Makefile:7645: recipe for target 'dlls/mscoree/tests' failed
Task: The exe32 Wine crossbuild failed

wxppro (32 bit comtest)

Windows XP Pro SP3 + IE8 / vm3Updated on 2014/04/17, added WinPcap, Silverlight, optional DirectX components, msxml4 SP3, Visual C++ 2005 SP1, 2008 SP1 and 2010 SP1 runtimes. [CPU:2*kvm32 RAM:1GB disk:virtio eth:rtl8139 snd:ac97 GPU:vga display:spice testagentd:1.6-detached]
Missions: exe32
No log, task skipped

w2003std (32 bit comtest)

Windows 2003 Std+IE8 / vm2Installed Internet Explorer 8, SP2 and all updates up to 2015/01/23. Added .Net 2.0 SP1, 3.0 SP2, 3.5 SP2 & 4, msxml4 SP3, Visual C++ 2005 SP1, 2008 SP1 & 2010 SP1 runtimes. [CPU:2*kvm32 RAM:1GB disk:virtio eth:e1000 snd:ac97 GPU:vga display:spice testagentd:1.6]
Missions: exe32
No log, task skipped

wvistau64 (32 bit comtest)

Vista Ultimate 64 bit English+IE8 / vm2Updated on 2014/04/21. Running tests from E: drive. Added WinPcap, Silverlight, optional DirectX components, msxml4 SP3, Visual C++ 2005/2008/2010 SP1, 2012/2013/2015 runtimes. [CPU:2*kvm64 RAM:1GB disks:2*virtio eth:e1000 snd:none GPU:vga display:VNC testagentd:1.6]
Missions: exe32
No log, task skipped

wvistau64_zh_CN (32 bit comtest)

Vista Ultimate 64 bit Chinese+IE8 / vm2Updated on 2014/04/21. Running tests from E: drive. Added WinPcap, Silverlight, optional DirectX components, msxml4 SP3, Visual C++ 2005/2008/2010 SP1, 2012/2013/2015 runtimes. [CPU:2*kvm64 RAM:1GB disks:2*virtio eth:e1000 snd:none GPU:vga display:VNC testagentd:1.6]
Missions: exe32
No log, task skipped

wvistau64_fr (32 bit comtest)

Vista Ultimate 64 bit French+IE8 / vm2Updated on 2014/04/21. Running tests from E: drive. Added WinPcap, Silverlight, optional DirectX components, msxml4 SP3, Visual C++ 2005/2008/2010 SP1, 2012/2013/2015 runtimes. [CPU:2*kvm64 RAM:1GB disks:2*virtio eth:e1000 snd:none GPU:vga display:VNC testagentd:1.6]
Missions: exe32
No log, task skipped

wvistau64_he (32 bit comtest)

Vista Ultimate 64 bit Hebrew+IE8 / vm2Updated on 2014/04/21. Running tests from E: drive. Added WinPcap, Silverlight, optional DirectX components, msxml4 SP3, Visual C++ 2005/2008/2010 SP1, 2012/2013/2015 runtimes. [CPU:2*kvm64 RAM:1GB disks:2*virtio eth:e1000 snd:none GPU:vga display:VNC testagentd:1.6]
Missions: exe32
No log, task skipped

w2008s64 (32 bit comtest)

Win Server 2008 Std 64-bit PU+IE9 / vm1Upgraded with Internet Explorer 9, .Net Framework 3.5 SP1 & 4.5.1 and all updates up to 2013/04/15. Added Visual C++ 2012 & 2013 runtimes. [CPU:2*kvm64 RAM:1GB disk:virtio eth:2*e1000 snd:none GPU:vga display:VNC testagentd:1.7]
Missions: exe32
No log, task skipped

w7u (32 bit comtest)

Windows 7 Ultimate Japanese+IE11 / vm1Installed Internet Explorer 11 + all updates up to 2016/07/25. Inserted the MemTest86 CD. [CPU:kvm32*2cores RAM:1.5GB disk:virtio eth:e1000 snd:ich6 GPU:cirrus display:spice testagentd:1.6-detached]
Missions: exe32
No log, task skipped

w7pro64 (32 bit comtest)

Windows 7 Pro 64 bit PU+IE11 / vm4Installed Internet Explorer 11 + the Platform Update + all updates up to 2014/04/15. Added .Net 4.5.1. [CPU:2*SandyBridge RAM:1GB disk:virtio eth:e1000 snd:ich6 GPU:vga display:spice testagentd:1.6-detached]
Missions: exe32
No log, task skipped

w8 (32 bit comtest)

Windows 8.1 Update + IE11 / vm4Updated 2014/04/15; added Silverlight, optional DirectX components, msxml4 SP3, Visual C++ 2005 SP1 & 2010 SP1 runtimes. [CPU:core2duo*2cores RAM:1-1.5GB disk:virtio eth:e1000 snd:ich6 GPU:vga screen:spice testagentd:1.6-detached]
Missions: exe32
No log, task skipped

w8adm (32 bit comtest)

Windows 8.1 Admin / vm4Same as w8 but without elevated privileges. Updated 2014/04/15; IE11, added Silverlight, optional DirectX components, msxml4 SP3, Visual C++ 2005 SP1 & 2010 SP1 runtimes. [CPU:core2duo*2cores RAM:1-1.5GB disk:virtio eth:e1000 snd:ich6 GPU:vga screen:spice testagentd:1.6-detached]
Missions: exe32
No log, task skipped

w864 (32 bit comtest)

Windows 8.1+ 64 bit+IE11 / vm3Updated 2014/04/15; added Silverlight, optional DirectX components, msxml4 SP3, Visual C++ 2005 SP1 & 2010 SP1 runtimes. [CPU:core2duo*2cores RAM:1.5GB disk:virtio eth:e1000 snd:ich6 GPU:vga display:spice testagentd:1.6-detached]
Missions: exe32
No log, task skipped

w1064 (32 bit comtest)

Windows 10 64 bit / vm3Clean Windows 10 Home 64 bit installed on 2015/09/13. Added optional DirectX components. [CPU:core2duo*2cores RAM:3GB disk:virtio eth:e1000 snd:ich6 GPU:vga display:spice testagentd:1.6-detached]
Missions: exe32
No log, task skipped

wvistau64 (64 bit comtest)

Vista Ultimate 64 bit English+IE8 / vm2Updated on 2014/04/21. Running tests from E: drive. Added WinPcap, Silverlight, optional DirectX components, msxml4 SP3, Visual C++ 2005/2008/2010 SP1, 2012/2013/2015 runtimes. [CPU:2*kvm64 RAM:1GB disks:2*virtio eth:e1000 snd:none GPU:vga display:VNC testagentd:1.6]
Missions: exe64
No log, task skipped

wvistau64_zh_CN (64 bit comtest)

Vista Ultimate 64 bit Chinese+IE8 / vm2Updated on 2014/04/21. Running tests from E: drive. Added WinPcap, Silverlight, optional DirectX components, msxml4 SP3, Visual C++ 2005/2008/2010 SP1, 2012/2013/2015 runtimes. [CPU:2*kvm64 RAM:1GB disks:2*virtio eth:e1000 snd:none GPU:vga display:VNC testagentd:1.6]
Missions: exe64
No log, task skipped

wvistau64_fr (64 bit comtest)

Vista Ultimate 64 bit French+IE8 / vm2Updated on 2014/04/21. Running tests from E: drive. Added WinPcap, Silverlight, optional DirectX components, msxml4 SP3, Visual C++ 2005/2008/2010 SP1, 2012/2013/2015 runtimes. [CPU:2*kvm64 RAM:1GB disks:2*virtio eth:e1000 snd:none GPU:vga display:VNC testagentd:1.6]
Missions: exe64
No log, task skipped

wvistau64_he (64 bit comtest)

Vista Ultimate 64 bit Hebrew+IE8 / vm2Updated on 2014/04/21. Running tests from E: drive. Added WinPcap, Silverlight, optional DirectX components, msxml4 SP3, Visual C++ 2005/2008/2010 SP1, 2012/2013/2015 runtimes. [CPU:2*kvm64 RAM:1GB disks:2*virtio eth:e1000 snd:none GPU:vga display:VNC testagentd:1.6]
Missions: exe64
No log, task skipped

w2008s64 (64 bit comtest)

Win Server 2008 Std 64-bit PU+IE9 / vm1Upgraded with Internet Explorer 9, .Net Framework 3.5 SP1 & 4.5.1 and all updates up to 2013/04/15. Added Visual C++ 2012 & 2013 runtimes. [CPU:2*kvm64 RAM:1GB disk:virtio eth:2*e1000 snd:none GPU:vga display:VNC testagentd:1.7]
Missions: exe64
No log, task skipped

w7pro64 (64 bit comtest)

Windows 7 Pro 64 bit PU+IE11 / vm4Installed Internet Explorer 11 + the Platform Update + all updates up to 2014/04/15. Added .Net 4.5.1. [CPU:2*SandyBridge RAM:1GB disk:virtio eth:e1000 snd:ich6 GPU:vga display:spice testagentd:1.6-detached]
Missions: exe64
No log, task skipped

w864 (64 bit comtest)

Windows 8.1+ 64 bit+IE11 / vm3Updated 2014/04/15; added Silverlight, optional DirectX components, msxml4 SP3, Visual C++ 2005 SP1 & 2010 SP1 runtimes. [CPU:core2duo*2cores RAM:1.5GB disk:virtio eth:e1000 snd:ich6 GPU:vga display:spice testagentd:1.6-detached]
Missions: exe64
No log, task skipped

w1064 (64 bit comtest)

Windows 10 64 bit / vm3Clean Windows 10 Home 64 bit installed on 2015/09/13. Added optional DirectX components. [CPU:core2duo*2cores RAM:3GB disk:virtio eth:e1000 snd:ich6 GPU:vga display:spice testagentd:1.6-detached]
Missions: exe64
No log, task skipped