Wine Test Bot
    

Job 49180 - [wine-patches] kernel32/path: Allow renaming a file/directory to a different capitalization of itself

Step no Task no Status VM Timeout File name Arguments / Missions Execution started Time Number of test failures
1 1 completed debian9 660 patch.diff 32 bit + Locales tests 1m 47s 5
1 2 completed debian9 720 patch.diff 32 & 64 bit WoW tests 1m 49s 13

debian9 (32 bit + Locales tests)

Debian 9 / vm4Debian 9.6 configured for Wine. Runs fvwm. [CPU:4*host RAM:2048MB disk:virtio-scsi eth:virtio snd:ich6 GPU:qxl display:spice testagentd:1.7]
Missions: win32,test=module:win32,lang=fr_FR:win32,lang=ja_JP:win32,test=module,lang=zh_CN
32 bit report
kernel32
change.c:320: Test failed: should be ready
Unhandled exception: page fault on write access to 0x00000000 in 32-bit code (0x7eb6785d).
file.c:1914: Test failed: MoveFileA: failed, error 3
Report errors
kernel32:virtual prints too much data (90431 bytes)
32 bit Chinese:China report
kernel32
Unhandled exception: page fault on write access to 0x00000000 in 32-bit code (0x7e9b285d).
file.c:1914: Test failed: MoveFileA: failed, error 3
Report errors
kernel32:virtual prints too much data (90431 bytes)

debian9 (32 & 64 bit WoW tests)

Debian 9 / vm4Debian 9.6 configured for Wine. Runs fvwm. [CPU:4*host RAM:2048MB disk:virtio-scsi eth:virtio snd:ich6 GPU:qxl display:spice testagentd:1.7]
Missions: wow32,test=module:wow64,test=module
32 bit WoW report
kernel32
Unhandled exception: page fault on write access to 0x00000000 in 32-bit code (0x7eb5085d).
file.c:1914: Test failed: MoveFileA: failed, error 3
Report errors
kernel32:virtual prints too much data (90502 bytes)
64 bit WoW report
kernel32
Unhandled exception: page fault on write access to 0x00000000 in 64-bit code (0x00007f759e85d8a1).
file.c:1917: Test failed: MoveFileA: unexpected error 2
file.c:1924: Test failed: failed to open source file
file.c:1927: Test failed: WriteFile error 6
file.c:1931: Test failed: CreateFileMapping: error 87
file.c:1935: Test failed: MoveFileA: expected ERROR_SHARING_VIOLATION, got 2
file.c:1946: Test failed: failed to open source file
file.c:1949: Test failed: CreateFileMapping: error 87
file.c:1953: Test failed: MoveFileA: expected ERROR_SHARING_VIOLATION, got 2
file.c:1964: Test failed: MoveFileA: failed, error 2
file.c:2003: Test failed: DeleteFileA: error 2
Report errors
kernel32:virtual prints too much data (87157 bytes)