Wine Test Bot
    

Job 45504 - WineTest: 64-bit VMs

Step no Task no Status VM Timeout File name Arguments / Missions Execution started Time Number of test failures
1 1 completed wvistau64 1800 winetest64-latest.exe 64 bit executable 23m 8s 25
1 2 completed w2008s64 1800 winetest64-latest.exe 64 bit executable 16m 4s 3
1 3 completed w7pro64 1800 winetest64-latest.exe 64 bit executable 17m 14s 0
1 4 completed w864 1800 winetest64-latest.exe 64 bit executable 17m 46s 0
1 5 completed w1064 1800 winetest64-latest.exe 64 bit executable 24m 20s 645

wvistau64 (64 bit)

Vista Ultimate 64 bit English+IE8 / vm2Updated on 2014/04/21. Running tests from E: drive. Added WinPcap, Silverlight, optional DirectX components, msxml4 SP3, Visual C++ 2005/2008/2010 SP1, 2012/2013/2015 runtimes. [CPU:2*kvm64 RAM:1GB disks:2*virtio eth:e1000 snd:none GPU:vga display:VNC testagentd:1.6-detached]
Missions: exe64
ddraw
ddraw2.c:2892: Test failed: Expected message 0x46, but didn't receive it.
ddraw2.c:2894: Test failed: Expected screen size 1024x768, got 0x0.
ddraw2.c:2900: Test failed: Expected (0,0)-(1024,768), got (-8,-8)-(1032,746).
ddraw2.c:2930: Test failed: Expected (0,0)-(1024,768), got (-8,-8)-(1032,746).
ddraw2.c:2937: Test failed: Expected (0,0)-(1024,768), got (-8,-8)-(1032,746).
ddraw2.c:2963: Test failed: Expected (0,0)-(1024,768), got (-8,-8)-(1032,746).
ddraw2.c:2986: Test failed: Expected (0,0)-(1024,768), got (-8,-8)-(1032,746).
ddraw2.c:3015: Test failed: Expected (0,0)-(1024,768), got (-8,-8)-(1032,746).
ddraw2.c:3041: Test failed: Expected (0,0)-(1024,768), got (-8,-8)-(1032,746).
ddraw2.c:3061: Test failed: Expected (0,0)-(1024,768), got (-8,-8)-(1032,746).
ddraw2.c:3097: Test failed: Expected (0,0)-(1024,768), got (-8,-8)-(1032,746).
ddraw2.c:3107: Test failed: Expected (0,0)-(1024,768), got (-8,-8)-(1032,746).
ddraw2.c:3133: Test failed: Expected (0,0)-(1024,768), got (-8,-8)-(1032,746).
ddraw2.c:3156: Test failed: Expected (0,0)-(1024,768), got (-8,-8)-(1032,746).
ddraw2.c:3178: Test failed: Expected (0,0)-(1024,768), got (-8,-8)-(1032,746).
ddraw2.c:3204: Test failed: Expected (0,0)-(1024,768), got (-8,-8)-(1032,746).
ddraw2.c:3224: Test failed: Expected (0,0)-(1024,768), got (-8,-8)-(1032,746).
ddraw2.c:3261: Test failed: Expected (0,0)-(1024,768), got (-8,-8)-(1032,746).
ddraw7.c:2671: Test failed: Expected message 0x46, but didn't receive it.
ddraw7.c:2674: Test failed: Expected (0,0)-(640,480), got (0,0)-(1024,768).
ddraw7.c:2678: Test failed: Got unexpect screen size 1024x768.
wmp
media.c:147: Test failed: unexpected event for  OPENSTATE, index:6
media.c:147: Test failed: unexpected event for  OPENSTATE, index:8
media.c:147: Test failed: unexpected event for  OPENSTATE, index:6
media.c:152: Test failed: unexpected event for  PLAYSTATE, index:10

w2008s64 (64 bit)

Win Server 2008 Std 64-bit PU+IE9 / vm2Upgraded with Internet Explorer 9, .Net Framework 3.5 SP1 & 4.5.1 and all updates up to 2013/04/15. Added Visual C++ 2012 & 2013 runtimes. [CPU:2*kvm64 RAM:1GB disk:virtio eth:2*e1000 snd:none GPU:vga display:VNC testagentd:1.5-iconized]
Missions: exe64
64 bit report
user32
msg.c:15262: Test failed: single menu item command: 2: in msg 0x0007 expecting lParam 0x20000001 got 0x60000001
msg.c:15262: Test failed: single menu item command: 3: in msg 0x0104 expecting lParam 0x20000001 got 0x60000001
msg.c:15262: Test failed: single menu item command: 4: in msg 0x0106 expecting lParam 0x20000001 got 0x60000001
Task log
Task errors
The previous 1 run(s) terminated abnormally

w7pro64 (64 bit)

Windows 7 Pro 64 bit PU+IE11 / vm4Installed Internet Explorer 11 + the Platform Update + all updates up to 2014/04/15. Added .Net 4.5.1. [CPU:2*SandyBridge RAM:1GB disk:virtio eth:e1000 snd:ich6 GPU:vga display:spice testagentd:1.6-detached]
Missions: exe64
No errors

w864 (64 bit)

Windows 8.1+ 64 bit+IE11 / vm3Updated 2014/04/15; added Silverlight, optional DirectX components, msxml4 SP3, Visual C++ 2005 SP1 & 2010 SP1 runtimes. [CPU:core2duo*2cores RAM:1.5GB disk:virtio eth:e1000 snd:ich6 GPU:vga display:spice testagentd:1.6-detached]
Missions: exe64
No errors

w1064 (64 bit)

Windows 10 64 bit / vm3Clean Windows 10 Home 64 bit installed on 2015/09/13. Added optional DirectX components. [CPU:core2duo*2cores RAM:3GB disk:virtio eth:e1000 snd:ich6 GPU:vga display:spice testagentd:1.6-detached]
Missions: exe64
msi
action: Timeout
install.c:2714: Test failed: Expected ERROR_PATH_NOT_FOUND, got 1618
install.c:2727: Test failed: Expected ERROR_SUCCESS, got 1618
install.c:2495: Test failed: File not installed
install.c:2496: Test failed: Directory not created
install.c:2497: Test failed: File not installed
install.c:2498: Test failed: Directory not created
install.c:2499: Test failed: File not installed
install.c:2500: Test failed: Directory not created
install.c:2501: Test failed: File not installed
install.c:2502: Test failed: Directory not created
install.c:2503: Test failed: File not installed
install.c:2504: Test failed: File not installed
install.c:2505: Test failed: Directory not created
install.c:2732: Test failed: Expected ERROR_SUCCESS, got 2
install.c:2737: Test failed: Expected ERROR_SUCCESS, got 6
install.c:2738: Test failed: Expected imaname, got
install.c:2743: Test failed: Expected ERROR_FILE_NOT_FOUND, got 6
install.c:2748: Test failed: Expected ERROR_SUCCESS, got 6
install.c:2749: Test failed: Expected 314, got 0
install.c:2754: Test failed: Expected ERROR_SUCCESS, got 6
install.c:2755: Test failed: Expected OrderTestValue, got
install.c:2761: Test failed: Expected ERROR_SUCCESS, got 1618
install.c:2495: Test failed: File not installed
install.c:2496: Test failed: Directory not created
install.c:2497: Test failed: File not installed
install.c:2498: Test failed: Directory not created
install.c:2499: Test failed: File not installed
install.c:2500: Test failed: Directory not created
install.c:2501: Test failed: File not installed
install.c:2502: Test failed: Directory not created
install.c:2503: Test failed: File not installed
install.c:2504: Test failed: File not installed
install.c:2505: Test failed: Directory not created
install.c:2766: Test failed: Expected ERROR_SUCCESS, got 2
install.c:2773: Test failed: Expected ERROR_SUCCESS, got 1618
install.c:2495: Test failed: File not installed
install.c:2496: Test failed: Directory not created
install.c:2497: Test failed: File not installed
install.c:2498: Test failed: Directory not created
install.c:2499: Test failed: File not installed
install.c:2500: Test failed: Directory not created
install.c:2501: Test failed: File not installed
install.c:2502: Test failed: Directory not created
install.c:2503: Test failed: File not installed
install.c:2504: Test failed: File not installed
install.c:2505: Test failed: Directory not created
install.c:2778: Test failed: Expected ERROR_SUCCESS, got 2
install.c:2785: Test failed: Expected ERROR_SUCCESS, got 1618
install.c:2495: Test failed: File not installed
install.c:2496: Test failed: Directory not created
install.c:2497: Test failed: File not installed
install.c:2498: Test failed: Directory not created
install.c:2499: Test failed: File not installed
install.c:2500: Test failed: Directory not created
install.c:2501: Test failed: File not installed
install.c:2502: Test failed: Directory not created
install.c:2503: Test failed: File not installed
install.c:2504: Test failed: File not installed
install.c:2505: Test failed: Directory not created
install.c:2790: Test failed: Expected ERROR_SUCCESS, got 2
install.c:2797: Test failed: Expected ERROR_SUCCESS, got 1618
install.c:2495: Test failed: File not installed
install.c:2496: Test failed: Directory not created
install.c:2497: Test failed: File not installed
install.c:2498: Test failed: Directory not created
install.c:2499: Test failed: File not installed
install.c:2500: Test failed: Directory not created
install.c:2501: Test failed: File not installed
install.c:2502: Test failed: Directory not created
install.c:2503: Test failed: File not installed
install.c:2504: Test failed: File not installed
install.c:2505: Test failed: Directory not created
install.c:2802: Test failed: Expected ERROR_SUCCESS, got 2
install.c:2809: Test failed: Expected ERROR_SUCCESS, got 1618
install.c:2495: Test failed: File not installed
install.c:2496: Test failed: Directory not created
install.c:2497: Test failed: File not installed
install.c:2498: Test failed: Directory not created
install.c:2499: Test failed: File not installed
install.c:2500: Test failed: Directory not created
install.c:2501: Test failed: File not installed
install.c:2502: Test failed: Directory not created
install.c:2503: Test failed: File not installed
install.c:2504: Test failed: File not installed
install.c:2505: Test failed: Directory not created
install.c:2820: Test failed: Expected ERROR_SUCCESS, got 1618
install.c:2495: Test failed: File not installed
install.c:2496: Test failed: Directory not created
install.c:2497: Test failed: File not installed
install.c:2498: Test failed: Directory not created
install.c:2499: Test failed: File not installed
install.c:2500: Test failed: Directory not created
install.c:2501: Test failed: File not installed
install.c:2502: Test failed: Directory not created
install.c:2503: Test failed: File not installed
install.c:2504: Test failed: File not installed
install.c:2505: Test failed: Directory not created
install.c:2831: Test failed: Expected ERROR_SUCCESS, got 1618
install.c:2495: Test failed: File not installed
install.c:2496: Test failed: Directory not created
install.c:2497: Test failed: File not installed
install.c:2498: Test failed: Directory not created
install.c:2499: Test failed: File not installed
install.c:2500: Test failed: Directory not created
install.c:2501: Test failed: File not installed
install.c:2502: Test failed: Directory not created
install.c:2503: Test failed: File not installed
install.c:2504: Test failed: File not installed
install.c:2505: Test failed: Directory not created
install.c:2842: Test failed: Expected ERROR_SUCCESS, got 1618
install.c:2495: Test failed: File not installed
install.c:2496: Test failed: Directory not created
install.c:2497: Test failed: File not installed
install.c:2498: Test failed: Directory not created
install.c:2499: Test failed: File not installed
install.c:2500: Test failed: Directory not created
install.c:2501: Test failed: File not installed
install.c:2502: Test failed: Directory not created
install.c:2503: Test failed: File not installed
install.c:2504: Test failed: File not installed
install.c:2505: Test failed: Directory not created
install.c:2853: Test failed: Expected ERROR_SUCCESS, got 1618
install.c:2495: Test failed: File not installed
install.c:2496: Test failed: Directory not created
install.c:2497: Test failed: File not installed
install.c:2498: Test failed: Directory not created
install.c:2499: Test failed: File not installed
install.c:2500: Test failed: Directory not created
install.c:2501: Test failed: File not installed
install.c:2502: Test failed: Directory not created
install.c:2503: Test failed: File not installed
install.c:2504: Test failed: File not installed
install.c:2505: Test failed: Directory not created
install.c:2861: Test failed: Expected ERROR_SUCCESS, got 1618
install.c:3056: Test failed: Expected ERROR_SUCCESS, got 1618
install.c:3057: Test failed: File not installed
install.c:3058: Test failed: File not installed
install.c:3059: Test failed: File not installed
install.c:3060: Test failed: Directory not created
install.c:3078: Test failed: Expected ERROR_SUCCESS, got 1618
install.c:3079: Test failed: File not installed
install.c:3081: Test failed: File not installed
install.c:3082: Test failed: File not installed
install.c:3083: Test failed: Directory not created
install.c:3104: Test failed: Expected ERROR_INSTALL_FAILURE, got 1618
install.c:3128: Test failed: Expected ERROR_SUCCESS, got 1618
install.c:3129: Test failed: File not installed
install.c:3130: Test failed: File not installed
install.c:3131: Test failed: File not installed
install.c:3132: Test failed: Directory not created
install.c:3163: Test failed: Expected ERROR_INSTALL_FAILURE, got 1618
install.c:3179: Test failed: Expected ERROR_INSTALL_FAILURE, got 1618
install.c:3192: Test failed: Expected ERROR_INSTALL_FAILURE, got 1618
install.c:3209: Test failed: Expected ERROR_INSTALL_FAILURE, got 1618
install.c:3253: Test failed: Expected ERROR_SUCCESS, got 1618
install.c:3254: Test failed: File not installed
install.c:3255: Test failed: File not installed
install.c:3256: Test failed: File not installed
install.c:3257: Test failed: Directory not created
install.c:3284: Test failed: Expected ERROR_SUCCESS, got 1618
install.c:3314: Test failed: Expected ERROR_SUCCESS, got 1618
install.c:3379: Test failed: Expected ERROR_SUCCESS, got 1618
install.c:3380: Test failed: Expected file to be overwritten
install.c:3381: Test failed: File not installed
install.c:3382: Test failed: Directory not created
install.c:3431: Test failed: Expected ERROR_SUCCESS, got 1618
install.c:3440: Test failed: Expected file to be overwritten, got ''
install.c:3441: Test failed: File not installed
install.c:3442: Test failed: Directory not created
install.c:3474: Test failed: Expected ERROR_SUCCESS, got 1618
install.c:3475: Test failed: File not installed
install.c:3476: Test failed: Directory not created
install.c:3515: Test failed: Expected ERROR_SUCCESS, got 1618
install.c:3516: Test failed: File not installed
install.c:3517: Test failed: File not installed
install.c:3518: Test failed: File not installed
install.c:3519: Test failed: File not installed
install.c:3520: Test failed: Directory not created
install.c:3749: Test failed: Expected ERROR_SUCCESS, got 1618
install.c:3759: Test failed: Expected ERROR_SUCCESS, got 1618
install.c:3760: Test failed: File not installed
install.c:3761: Test failed: Directory not created
install.c:3798: Test failed: Expected ERROR_FILE_NOT_FOUND, got 1618
install.c:3810: Test failed: Expected ERROR_SUCCESS, got 1618
install.c:3811: Test failed: File not installed
install.c:3812: Test failed: Directory not created
install.c:3826: Test failed: Expected ERROR_SUCCESS, got 1618
install.c:3827: Test failed: File not installed
install.c:3828: Test failed: Directory not created
install.c:3882: Test failed: Expected ERROR_SUCCESS, got 1618
install.c:3890: Test failed: Expected ERROR_SUCCESS, got 1618
install.c:3895: Test failed: File not installed
install.c:3896: Test failed: File not installed
install.c:3961: Test failed: Expected ERROR_SUCCESS, got 1618
install.c:3962: Test failed: File installed
install.c:3963: Test failed: Directory created
install.c:4019: Test failed: Expected ERROR_SUCCESS, got 1618
install.c:4020: Test failed: File not installed
install.c:4021: Test failed: File not installed
install.c:4026: Test failed: Directory not created
install.c:4034: Test failed: Expected ERROR_INSTALL_FAILURE, got 1618
install.c:4044: Test failed: Directory not created
install.c:4080: Test failed: Expected ERROR_INSTALL_FAILURE, got 1618
install.c:4090: Test failed: Expected ERROR_INSTALL_FAILURE, got 1618
install.c:4127: Test failed: Expected ERROR_SUCCESS, got 1618
install.c:4131: Test failed: Expected ERROR_SUCCESS, got 1618
install.c:4134: Test failed: Expected ERROR_SUCCESS, got 1618
install.c:4137: Test failed: Expected ERROR_INSTALL_USEREXIT, got 1618
install.c:4140: Test failed: Expected ERROR_SUCCESS, got 1618
install.c:4144: Test failed: Expected ERROR_INSTALL_FAILURE, got 1618
install.c:4148: Test failed: got 1618
install.c:4152: Test failed: got 1618
install.c:4183: Test failed: Expected ERROR_SUCCESS, got 1618
install.c:4184: Test failed: File installed
install.c:4185: Test failed: Directory created
install.c:4227: Test failed: Expected ERROR_SUCCESS, got 1618
install.c:4228: Test failed: File not installed
install.c:4230: Test failed: File not installed
install.c:4231: Test failed: File not installed
install.c:4240: Test failed: Directory not created
install.c:4243: Test failed: Expected ERROR_SUCCESS, got 1618
install.c:4244: Test failed: File not installed
install.c:4246: Test failed: File not installed
install.c:4247: Test failed: File not installed
install.c:4249: Test failed: File not installed
install.c:4250: Test failed: File not installed
install.c:4252: Test failed: File not installed
install.c:4256: Test failed: Directory not created
install.c:4259: Test failed: Expected ERROR_SUCCESS, got 1618
install.c:4260: Test failed: File not installed
install.c:4263: Test failed: File not installed
install.c:4266: Test failed: File not installed
install.c:4272: Test failed: Directory not created
install.c:4275: Test failed: Expected ERROR_SUCCESS, got 1618
install.c:4710: Test failed: Expected ERROR_SUCCESS, got 1618
install.c:4711: Test failed: File not installed
install.c:4712: Test failed: File not installed
install.c:4713: Test failed: File not installed
install.c:4718: Test failed: Expected ERROR_SUCCESS, got 1618
install.c:4758: Test failed: Expected ERROR_SUCCESS, got 1618
install.c:4759: Test failed: File installed
install.c:4760: Test failed: Directory created
install.c:4772: Test failed: Expected ERROR_SUCCESS, got 1618
install.c:4773: Test failed: File installed
install.c:4774: Test failed: Directory created
install.c:4820: Test failed: Expected ERROR_SUCCESS, got 1618
install.c:2495: Test failed: File not installed
install.c:2496: Test failed: Directory not created
install.c:2497: Test failed: File not installed
install.c:2498: Test failed: Directory not created
install.c:2499: Test failed: File not installed
install.c:2500: Test failed: Directory not created
install.c:2501: Test failed: File not installed
install.c:2502: Test failed: Directory not created
install.c:2503: Test failed: File not installed
install.c:2504: Test failed: File not installed
install.c:2505: Test failed: Directory not created
install.c:4862: Test failed: Expected ERROR_SUCCESS, got 1618
install.c:4863: Test failed: File not installed
install.c:4864: Test failed: Directory not created
install.c:4867: Test failed: Expected ERROR_SUCCESS, got 1618
install.c:4868: Test failed: File not installed
install.c:4869: Test failed: Directory not created
install.c:4872: Test failed: Expected ERROR_SUCCESS, got 1618
install.c:4873: Test failed: File not installed
install.c:4874: Test failed: Directory not created
install.c:4971: Test failed: Expected ERROR_SUCCESS, got 1618
install.c:4977: Test failed: Expected ERROR_SUCCESS, got 1618
install.c:4985: Test failed: Expected ERROR_SUCCESS, got 1618
install.c:2495: Test failed: File not installed
install.c:2496: Test failed: Directory not created
install.c:2497: Test failed: File not installed
install.c:2498: Test failed: Directory not created
install.c:2499: Test failed: File not installed
install.c:2500: Test failed: Directory not created
install.c:2501: Test failed: File not installed
install.c:2502: Test failed: Directory not created
install.c:2503: Test failed: File not installed
install.c:2504: Test failed: File not installed
install.c:2505: Test failed: Directory not created
install.c:5018: Test failed: Expected ERROR_SUCCESS, got 1618
install.c:5029: Test failed: File not installed
install.c:5030: Test failed: Directory not created
install.c:5033: Test failed: Expected ERROR_SUCCESS, got 1618
install.c:5035: Test failed: File not installed
install.c:5036: Test failed: Directory not created
install.c:5037: Test failed: File not installed
install.c:5038: Test failed: Directory not created
install.c:5039: Test failed: File not installed
install.c:5040: Test failed: Directory not created
install.c:5041: Test failed: File not installed
install.c:5042: Test failed: Directory not created
install.c:5043: Test failed: File not installed
install.c:5045: Test failed: Directory not created
install.c:5074: Test failed: Expected ERROR_SUCCESS, got 1618
install.c:5077: Test failed: Expected ERROR_INSTALL_FAILURE, got 1618
install.c:5080: Test failed: Expected ERROR_INSTALL_FAILURE, got 1618
install.c:2495: Test failed: File not installed
install.c:2496: Test failed: Directory not created
install.c:2497: Test failed: File not installed
install.c:2498: Test failed: Directory not created
install.c:2499: Test failed: File not installed
install.c:2500: Test failed: Directory not created
install.c:2501: Test failed: File not installed
install.c:2502: Test failed: Directory not created
install.c:2503: Test failed: File not installed
install.c:2504: Test failed: File not installed
install.c:2505: Test failed: Directory not created
install.c:5085: Test failed: Expected ERROR_SUCCESS, got 1618
install.c:5284: Test failed: Expected ERROR_SUCCESS_REBOOT_REQUIRED got 1618
install.c:5221: Test failed: Expected a 'msitest' entry
install.c:5239: Test failed: Expected file to match
install.c:5293: Test failed: File not present
install.c:5294: Test failed: Directory not present or not empty
install.c:5297: Test failed: Expected ERROR_SUCCESS, got 1618
install.c:5346: Test failed: Expected ERROR_SUCCESS_REBOOT_REQUIRED got 1618
install.c:5221: Test failed: Expected a 'msitest' entry
install.c:5239: Test failed: Expected file to match
install.c:5355: Test failed: File not present
install.c:5356: Test failed: Directory not present or not empty
install.c:5359: Test failed: Expected ERROR_SUCCESS, got 1618
install.c:5114: Test failed: Expected ERROR_SUCCESS, got 1618
install.c:2495: Test failed: File not installed
install.c:2496: Test failed: Directory not created
install.c:2497: Test failed: File not installed
install.c:2498: Test failed: Directory not created
install.c:2499: Test failed: File not installed
install.c:2500: Test failed: Directory not created
install.c:2501: Test failed: File not installed
install.c:2502: Test failed: Directory not created
install.c:2503: Test failed: File not installed
install.c:2504: Test failed: File not installed
install.c:2505: Test failed: Directory not created
install.c:5119: Test failed: Expected ERROR_SUCCESS, got 1618
install.c:5128: Test failed: Expected ERROR_SUCCESS, got 1618
install.c:2495: Test failed: File not installed
install.c:2496: Test failed: Directory not created
install.c:2497: Test failed: File not installed
install.c:2498: Test failed: Directory not created
install.c:2499: Test failed: File not installed
install.c:2500: Test failed: Directory not created
install.c:2501: Test failed: File not installed
install.c:2502: Test failed: Directory not created
install.c:2503: Test failed: File not installed
install.c:2504: Test failed: File not installed
install.c:2505: Test failed: Directory not created
install.c:5133: Test failed: Expected ERROR_SUCCESS, got 1618
install.c:5142: Test failed: Expected ERROR_SUCCESS, got 1618
install.c:2495: Test failed: File not installed
install.c:2496: Test failed: Directory not created
install.c:2497: Test failed: File not installed
install.c:2498: Test failed: Directory not created
install.c:2499: Test failed: File not installed
install.c:2500: Test failed: Directory not created
install.c:2501: Test failed: File not installed
install.c:2502: Test failed: Directory not created
install.c:2503: Test failed: File not installed
install.c:2504: Test failed: File not installed
install.c:2505: Test failed: Directory not created
install.c:5147: Test failed: Expected ERROR_SUCCESS, got 1618
install.c:5156: Test failed: Expected ERROR_INSTALL_FAILURE, got 1618
install.c:5400: Test failed: Expected ERROR_SUCCESS, got 1618
install.c:5402: Test failed: file not installed
install.c:5407: Test failed: Expected ERROR_SUCCESS, got 1618
install.c:5412: Test failed: Expected ERROR_SUCCESS, got 1618
install.c:5414: Test failed: file not installed
install.c:5415: Test failed: file not installed
install.c:5419: Test failed: Expected ERROR_SUCCESS, got 1618
install.c:5423: Test failed: file removed
install.c:5424: Test failed: directory removed
install.c:5428: Test failed: Expected ERROR_SUCCESS, got 1618
install.c:5430: Test failed: file not installed
install.c:5431: Test failed: file not installed
install.c:5435: Test failed: Expected ERROR_SUCCESS, got 1618
install.c:5439: Test failed: file removed
install.c:5440: Test failed: directory removed
install.c:5503: Test failed: Failed to do per-user install: 1618
install.c:5510: Test failed: Per-user icon file isn't where it's expected (C:\Users\winetest\AppData\Roaming\Microsoft\Installer\{7DF88A49-996F-4EC8-A022-BF956F9B2CBB}\testicon)
install.c:5513: Test failed: Failed to uninstall per-user
install.c:5518: Test failed: Failed to system-wide install: 1618
install.c:5525: Test failed: System-wide icon file isn't where it's expected (C:\Windows\Installer\{7DF88A49-996F-4EC8-A022-BF956F9B2CBB}\testicon)
install.c:5528: Test failed: Failed to uninstall system-wide
install.c:5557: Test failed: Expected ERROR_SUCCESS, got 1618
install.c:5558: Test failed: file does not exist
install.c:5559: Test failed: directory does not exist
install.c:5565: Test failed: Expected ERROR_INSTALL_LANGUAGE_UNSUPPORTED, got 1618
install.c:5571: Test failed: Expected ERROR_INSTALL_LANGUAGE_UNSUPPORTED, got 1618
install.c:5577: Test failed: Expected ERROR_SUCCESS, got 1618
install.c:5578: Test failed: file does not exist
install.c:5579: Test failed: directory does not exist
install.c:5585: Test failed: Expected ERROR_INSTALL_PLATFORM_UNSUPPORTED, got 1618
install.c:5591: Test failed: Expected ERROR_INSTALL_PLATFORM_UNSUPPORTED, got 1618
install.c:5597: Test failed: Expected ERROR_INSTALL_PLATFORM_UNSUPPORTED, got 1618
install.c:5603: Test failed: Expected ERROR_INSTALL_LANGUAGE_UNSUPPORTED, got 1618
install.c:5612: Test failed: Expected ERROR_SUCCESS, got 1618
install.c:5613: Test failed: file does not exist
install.c:5614: Test failed: directory does not exist
install.c:5619: Test failed: Expected ERROR_SUCCESS, got 1618
install.c:5620: Test failed: file does not exist
install.c:5621: Test failed: directory does not exist
install.c:5628: Test failed: Expected ERROR_INSTALL_PLATFORM_UNSUPPORTED, got 1618
install.c:5638: Test failed: Expected ERROR_SUCCESS, got 1618
install.c:5639: Test failed: file does not exist
install.c:5640: Test failed: directory does not exist
install.c:5646: Test failed: Expected ERROR_INSTALL_PACKAGE_INVALID, got 1618
install.c:5654: Test failed: Expected ERROR_SUCCESS, got 1618
install.c:5655: Test failed: file does not exist
install.c:5656: Test failed: directory does not exist
install.c:5743: Test failed: Expected ERROR_SUCCESS, got 1618
install.c:5745: Test failed: file not installed
install.c:5748: Test failed: Expected ERROR_SUCCESS, got 1618
install.c:5785: Test failed: Expected ERROR_SUCCESS, got 1618
install.c:5788: Test failed: can't open 32-bit component key, got 2
install.c:5790: Test failed: expected RegQueryValueEx to succeed, got 6
install.c:5796: Test failed: can't open 64-bit component key, got 2
install.c:5800: Test failed: expected RegQueryValueEx to succeed, got 6
install.c:5806: Test failed: can't open 32-bit CLSID key, got 2
install.c:5817: Test failed: can't open 64-bit CLSID key, got 2
install.c:5826: Test failed: Expected ERROR_SUCCESS, got 1618
install.c:5848: Test failed: Expected ERROR_SUCCESS, got 1618
install.c:5851: Test failed: can't open 32-bit component key, got 2
install.c:5853: Test failed: expected RegQueryValueEx to succeed, got 6
install.c:5859: Test failed: can't open 64-bit component key, got 2
install.c:5863: Test failed: expected RegQueryValueEx to succeed, got 6
install.c:5869: Test failed: can't open 32-bit CLSID key, got 2
install.c:5880: Test failed: can't open 64-bit CLSID key, got 2
install.c:5889: Test failed: Expected ERROR_SUCCESS, got 1618
install.c:5927: Test failed: got 1618
install.c:5930: Test failed: got 1618
install.c:5956: Test failed: got 1618
install.c:5958: Test failed: file not installed
install.c:5961: Test failed: got 1618
install.c:5963: Test failed: file not installed
install.c:5966: Test failed: got 1618
install.c:5968: Test failed: file removed
install.c:5971: Test failed: got 1618
install.c:6003: Test failed: got 1618
install.c:6008: Test failed: got 2
install.c:6014: Test failed: got 6
install.c:6015: Test failed: got 3735928559
install.c:6017: Test failed: wrong data
install.c:6021: Test failed: Expected ERROR_SUCCESS, got 1618
install.c:6048: Test failed: got 1618
install.c:6051: Test failed: got 1618
install.c:6054: Test failed: got 1618
install.c:6092: Test failed: Expected ERROR_SUCCESS, got 1618
install.c:6069: Test failed: got
install.c:6178: Test failed: got 1618
install.c:6181: Test failed: got 1618
install.c:6184: Test failed: got 1618
install.c:2495: Test failed: File not installed
install.c:2496: Test failed: Directory not created
install.c:2497: Test failed: File not installed
install.c:2498: Test failed: Directory not created
install.c:2499: Test failed: File not installed
install.c:2500: Test failed: Directory not created
install.c:2501: Test failed: File not installed
install.c:2502: Test failed: Directory not created
install.c:2503: Test failed: File not installed
install.c:2504: Test failed: File not installed
install.c:2505: Test failed: Directory not created
msi.c:948: Test failed: wrong error 1618
msi.c:3404: Test failed: Expected ERROR_SUCCESS, got 1618
msi.c:3407: Test failed: got -1
msi.c:3414: Test failed: got 1605
msi.c:3415: Test failed: empty path
msi.c:3416: Test failed: got 256
msi.c:3422: Test failed: got 1605
msi.c:3423: Test failed: got 0
msi.c:3429: Test failed: got 1605
msi.c:3430: Test failed: got 0
msi.c:3438: Test failed: got 1605
msi.c:3439: Test failed: empty path
msi.c:3440: Test failed: got 256
msi.c:3445: Test failed: got 1605
msi.c:3446: Test failed: got 0
msi.c:3451: Test failed: got 1605
msi.c:3452: Test failed: got 0
msi.c:3455: Test failed: got 1618
msi.c:13561: Test failed: Expected ERROR_UNKNOWN_PRODUCT, got 1618
msi.c:13568: Test failed: Expected ERROR_UNKNOWN_PRODUCT, got 1618
msi.c:13575: Test failed: Expected ERROR_UNKNOWN_PRODUCT, got 1618
msi.c:13585: Test failed: Expected ERROR_SUCCESS, got 1618
msi.c:13586: Test failed: File not installed
msi.c:13587: Test failed: File not installed
msi.c:13588: Test failed: File not installed
msi.c:13589: Test failed: File not installed
msi.c:13595: Test failed: Expected ERROR_SUCCESS, got 1618
msi.c:13605: Test failed: Expected ERROR_UNKNOWN_PRODUCT, got 1618
msi.c:13610: Test failed: Expected ERROR_SUCCESS, got 1618
msi.c:13611: Test failed: File not installed
msi.c:13612: Test failed: File not installed
msi.c:13613: Test failed: File not installed
msi.c:13614: Test failed: File not installed
msi.c:13620: Test failed: Expected ERROR_SUCCESS, got 1618
msi.c:13630: Test failed: Expected ERROR_UNKNOWN_PRODUCT, got 1618
msi.c:13635: Test failed: Expected ERROR_SUCCESS, got 1618
msi.c:13636: Test failed: File not installed
msi.c:13637: Test failed: File not installed
msi.c:13638: Test failed: File not installed
msi.c:13639: Test failed: File not installed
msi.c:13647: Test failed: Expected ERROR_SUCCESS, got 1618
msi.c:13657: Test failed: Expected ERROR_SUCCESS, got 1618
msi.c:13658: Test failed: File not installed
msi.c:13659: Test failed: File not installed
msi.c:13660: Test failed: File not installed
msi.c:13661: Test failed: File not installed
msi.c:13670: Test failed: Expected ERROR_SUCCESS, got 2
msi.c:13676: Test failed: Expected ERROR_SUCCESS, got 6
msi.c:13680: Test failed: Expected ERROR_SUCCESS, got 6
msi.c:13686: Test failed: Expected ERROR_INSTALL_SOURCE_ABSENT, got 1618
msi.c:13688: Test failed: File not installed
msi.c:13689: Test failed: File not installed
msi.c:13690: Test failed: File not installed
msi.c:13691: Test failed: File not installed
msi.c:13700: Test failed: Expected ERROR_SUCCESS, got 1618
msi.c:13709: Test failed: Expected ERROR_SUCCESS, got 1618
msi.c:13710: Test failed: File not installed
msi.c:13711: Test failed: File not installed
msi.c:13712: Test failed: File not installed
msi.c:13713: Test failed: File not installed
msi.c:13720: Test failed: Expected ERROR_SUCCESS, got 2
msi.c:13726: Test failed: Expected ERROR_SUCCESS, got 6
msi.c:13730: Test failed: Expected ERROR_SUCCESS, got 6
msi.c:13736: Test failed: Expected ERROR_SUCCESS, got 2
msi.c:13742: Test failed: Expected ERROR_SUCCESS, got 6
msi.c:13746: Test failed: Expected ERROR_SUCCESS, got 6
msi.c:13752: Test failed: Expected ERROR_INSTALL_SOURCE_ABSENT, got 1618
msi.c:13754: Test failed: File not installed
msi.c:13755: Test failed: File not installed
msi.c:13756: Test failed: File not installed
msi.c:13757: Test failed: File not installed
msi.c:13762: Test failed: Expected ERROR_SUCCESS, got 6
msi.c:13767: Test failed: Expected ERROR_SUCCESS, got 6
msi.c:13773: Test failed: Expected ERROR_SUCCESS, got 1618
msi.c:14089: Test failed: expected ERROR_SUCCESS, got 1618
msi.c:14098: Test failed: expected ERROR_SUCCESS, got 1605
msi.c:14099: Test failed: expected "C:\Users\winetest\AppData\Local\Temp\", got "aaa"
msi.c:14100: Test failed: expected 37, got 260
msi.c:14103: Test failed: expected ERROR_SUCCESS, got 1618
msi.c:14115: Test failed: expected ERROR_SUCCESS, got 1618
msi.c:14124: Test failed: expected ERROR_SUCCESS, got 1605
msi.c:14125: Test failed: expected "C:\Users\winetest\AppData\Local\Temp\", got "aaa"
msi.c:14126: Test failed: expected 37, got 260
msi.c:14129: Test failed: expected ERROR_SUCCESS, got 1618
msi.c:14143: Test failed: expected ERROR_SUCCESS, got 1618
msi.c:14149: Test failed: expected ERROR_SUCCESS, got 1605
msi.c:14150: Test failed: expected "C:\Users\winetest\AppData\Local\Temp\", got "aaa"
msi.c:14151: Test failed: expected 37, got 260
msi.c:14154: Test failed: expected ERROR_SUCCESS, got 1618
msi: Timeout
shell32
autocomplete.c:719: Test failed: Expected L"auto complete", got L"au"
autocomplete.c:720: Test failed: Expected 1 reset, got 0
autocomplete.c:726: Test failed: Expected 1 reset, got 0
autocomplete.c:729: Test failed: Expected 1 reset, got 0
autocomplete.c:743: Test failed: Expected 1 reset, got 0
autocomplete.c:758: Test failed: Expected L"auto complete", got L"au"
autocomplete.c:759: Test failed: Expected 2 resets, got 0
autocomplete.c:764: Test failed: AutoComplete DropDown should be visible
autocomplete.c:512: Test failed: Expected 1 expansion, got 0
autocomplete.c:513: Test failed: Expected L"test\\", got L""
autocomplete.c:514: Test failed: Expected 1 reset, got 0
autocomplete.c:519: Test failed: Expected 2 expansions, got 0
autocomplete.c:520: Test failed: Expected L"test\\foo\\bar\\", got L""
autocomplete.c:521: Test failed: Expected 2 resets, got 1
autocomplete.c:530: Test failed: Expected 2 expansions, got 0
autocomplete.c:531: Test failed: Expected 2 resets, got 1
autocomplete.c:534: Test failed: Expected 3 expansions, got 0
autocomplete.c:535: Test failed: Expected L"test\\foo\\bar\\baz_bbq\\", got L""
autocomplete.c:536: Test failed: Expected 3 resets, got 1
autocomplete.c:541: Test failed: Expected 4 expansions, got 0
autocomplete.c:542: Test failed: Expected L"test\\", got L""
autocomplete.c:543: Test failed: Expected 4 resets, got 1
autocomplete.c:547: Test failed: Expected 4 expansions, got 0
autocomplete.c:548: Test failed: Expected 5 resets, got 1
autocomplete.c:785: Test failed: Expected 1 reset, got 0
autocomplete.c:788: Test failed: Expected 1 reset, got 0
autocomplete.c:599: Test failed: Expected L"a0", got L"a"
autocomplete.c:600: Test failed: AutoComplete DropDown not visible
autocomplete.c:600: Test failed: AutoComplete DropDown not visible
autocomplete.c:600: Test failed: Expected L"http://a0", got (null)
autocomplete.c:600: Test failed: AutoComplete DropDown not visible
autocomplete.c:600: Test failed: Expected L"aa", got (null)
autocomplete.c:600: Test failed: AutoComplete DropDown not visible
autocomplete.c:600: Test failed: Expected L"ab", got (null)
autocomplete.c:600: Test failed: AutoComplete DropDown not visible
autocomplete.c:600: Test failed: Expected L"http://abc.aa.com", got (null)
autocomplete.c:600: Test failed: AutoComplete DropDown not visible
autocomplete.c:600: Test failed: Expected L"https://www.ac", got (null)
autocomplete.c:600: Test failed: AutoComplete DropDown not visible
autocomplete.c:600: Test failed: Expected L"http://www.add", got (null)
autocomplete.c:600: Test failed: AutoComplete DropDown not visible
autocomplete.c:600: Test failed: Expected L"www.ax", got (null)
autocomplete.c:600: Test failed: AutoComplete DropDown not visible
autocomplete.c:622: Test failed: Expected L"www.ac", got L"www.a"
autocomplete.c:623: Test failed: AutoComplete DropDown not visible
autocomplete.c:623: Test failed: AutoComplete DropDown not visible
autocomplete.c:623: Test failed: Expected L"https://www.ac", got (null)
autocomplete.c:623: Test failed: AutoComplete DropDown not visible
autocomplete.c:623: Test failed: Expected L"http://www.add", got (null)
autocomplete.c:623: Test failed: AutoComplete DropDown not visible
autocomplete.c:623: Test failed: Expected L"www.ax", got (null)
autocomplete.c:623: Test failed: AutoComplete DropDown not visible
autocomplete.c:629: Test failed: Expected L"www.www.?", got L"www.w"
autocomplete.c:635: Test failed: Expected L"hfoo", got L"h"
autocomplete.c:636: Test failed: AutoComplete DropDown not visible
autocomplete.c:636: Test failed: AutoComplete DropDown not visible
autocomplete.c:636: Test failed: Expected L"hfoo", got (null)
autocomplete.c:636: Test failed: AutoComplete DropDown not visible
autocomplete.c:636: Test failed: Expected L"https://hta", got (null)
autocomplete.c:636: Test failed: AutoComplete DropDown not visible
autocomplete.c:639: Test failed: Expected L"hta", got L"ht"
autocomplete.c:640: Test failed: AutoComplete DropDown not visible
autocomplete.c:640: Test failed: AutoComplete DropDown not visible
autocomplete.c:640: Test failed: Expected L"https://hta", got (null)
autocomplete.c:640: Test failed: AutoComplete DropDown not visible
autocomplete.c:652: Test failed: Expected L"http://a0", got L"http://a"
autocomplete.c:653: Test failed: AutoComplete DropDown not visible
autocomplete.c:653: Test failed: AutoComplete DropDown not visible
autocomplete.c:653: Test failed: Expected L"http://a0", got (null)
autocomplete.c:653: Test failed: AutoComplete DropDown not visible
autocomplete.c:653: Test failed: Expected L"http://abc.aa.com", got (null)
autocomplete.c:653: Test failed: AutoComplete DropDown not visible
autocomplete.c:660: Test failed: AutoComplete DropDown not visible
autocomplete.c:660: Test failed: AutoComplete DropDown not visible
autocomplete.c:660: Test failed: Expected L"http://a0", got (null)
autocomplete.c:660: Test failed: AutoComplete DropDown not visible
autocomplete.c:660: Test failed: Expected L"http://abc.aa.com", got (null)
autocomplete.c:660: Test failed: AutoComplete DropDown not visible
autocomplete.c:666: Test failed: AutoComplete DropDown not visible
autocomplete.c:666: Test failed: AutoComplete DropDown not visible
autocomplete.c:666: Test failed: Expected L"file://aa", got (null)
autocomplete.c:666: Test failed: AutoComplete DropDown not visible
autocomplete.c:666: Test failed: Expected L"ftp://abc", got (null)
autocomplete.c:666: Test failed: AutoComplete DropDown not visible
autocomplete.c:666: Test failed: Expected L"ftp://www.aa", got (null)
autocomplete.c:666: Test failed: AutoComplete DropDown not visible
autocomplete.c:670: Test failed: AutoComplete DropDown not visible
autocomplete.c:670: Test failed: AutoComplete DropDown not visible
autocomplete.c:670: Test failed: Expected L"file://aa", got (null)
autocomplete.c:670: Test failed: AutoComplete DropDown not visible
user32
dde: Timeout
sysparams: Timeout
Report errors
gameux:gameexplorer crashed (c0000005)