Wine Test Bot
    

Job 39811 - WineTest: base VMs

Step no Task no Status VM Timeout File name Command line args Execution started Execution ended Number of test failures
1 1 completed wxppro 1800 winetest-latest.exe 0
1 2 completed w2003std 1800 winetest-latest.exe 13
1 3 completed wvistau64 1800 winetest-latest.exe 21
1 4 completed wvistau64_zh_CN 1800 winetest-latest.exe 55
1 5 completed wvistau64_fr 1800 winetest-latest.exe 95
1 6 completed wvistau64_he 1800 winetest-latest.exe 25
1 7 completed w2008s64 1800 winetest-latest.exe 4
1 8 completed w7u 1800 winetest-latest.exe 4
1 9 completed w7pro64 1800 winetest-latest.exe 5
1 10 completed w8 1800 winetest-latest.exe 11
1 11 completed w8adm 1800 winetest-latest.exe 1132
1 12 completed w864 1800 winetest-latest.exe 9
1 13 completed w1064 1800 winetest-latest.exe 15

wxppro

Windows XP Pro SP3 + IE8 / vm3Updated on 2014/04/17, added WinPcap, Silverlight, optional DirectX components, msxml4 SP3, Visual C++ 2005 SP1, 2008 SP1 and 2010 SP1 runtimes. [CPU:2*kvm32 RAM:1GB disk:virtio eth:rtl8139 snd:ac97 GPU:vga display:spice testagentd:1.6-detached]
No test failures found

w2003std

Windows 2003 Std+IE8 / vm2Installed Internet Explorer 8, SP2 and all updates up to 2015/01/23. Added .Net 2.0 SP1, 3.0 SP2, 3.5 SP2 & 4, msxml4 SP3, Visual C++ 2005 SP1, 2008 SP1 & 2010 SP1 runtimes. [CPU:2*kvm32 RAM:1GB disk:virtio eth:e1000 snd:ac97 GPU:vga display:spice testagentd:1.6-iconized]
crypt32:
chain.c:4529: Test failed: ignoredInvalidDateBasePolicyCheck[0](#0001): expected 800b0101, got 800b0109
chain.c:4529: Test failed: googlePolicyCheckWithMatchingNameExpired[0](#0004): expected 800b0101, got 800b0109
chain.c:4529: Test failed: googlePolicyCheckWithMatchingName[0](#0004): expected 00000000, got 800b0109
chain.c:4529: Test failed: googlePolicyCheckWithMatchingName[0](#0004): expected 00000000, got 800b0109
chain.c:4529: Test failed: ignoredInvalidDateBasePolicyCheck[0](#0002): expected 800b0101, got 800b0109
urlmon:
url.c:3895: Test failed: request failed: 12045
user32:
msg.c:14771: Test failed: single menu item command: 2: in msg 0x0007 expecting lParam 0x20000001 got 0x60000001
msg.c:14771: Test failed: single menu item command: 3: in msg 0x0104 expecting lParam 0x20000001 got 0x60000001
msg.c:14771: Test failed: single menu item command: 4: in msg 0x0106 expecting lParam 0x20000001 got 0x60000001
winhttp:
winhttp.c:3908: Test failed: got 80072f0d
wininet:
http.c:6015: Test failed: HttpSendRequest failed: 12045
http.c:6816: Test failed: HttpSendRequest failed with error 12045
wmp:
0c24:oleobj: unhandled exception c0000005 at 4F9456CB

wvistau64

Vista Ultimate 64 bit English+IE8 / vm2Updated on 2014/04/21. Running tests from E: drive. Added WinPcap, Silverlight, optional DirectX components, msxml4 SP3, Visual C++ 2005/2008/2010 SP1, 2012/2013/2015 runtimes. [CPU:2*kvm64 RAM:1GB disks:2*virtio eth:e1000 snd:none GPU:vga display:VNC testagentd:1.6-detached]
user32:
win.c:9831: Test failed: GetActiveWindow() = 003401D8
win.c:9831: Test failed: GetFocus() = 00000000
win.c:9833: Test failed: expected 003401D8, got 00B40354
win.c:9836: Test failed: GetActiveWindow() = 003401D8
win.c:9836: Test failed: GetFocus() = 00000000
win.c:9837: Test failed: expected 003401D8, got 00B40354
win.c:9859: Test failed: GetActiveWindow() = 003401D8
win.c:9859: Test failed: GetFocus() = 00000000
win.c:9861: Test failed: expected 003401D8, got 0006012E
win.c:9862: Test failed: expected 0006012E, got 0019023C
win.c:9875: Test failed: GetActiveWindow() = 003401D8
win.c:9875: Test failed: GetFocus() = 00000000
win.c:9882: Test failed: GetFocus() = 00000000
win.c:9893: Test failed: GetActiveWindow() = 001B023C
win.c:9893: Test failed: GetFocus() = 00000000
win.c:9904: Test failed: GetFocus() = 00000000
wmp:
media.c:147: Test failed: unexpected event for  OPENSTATE, index:6
media.c:147: Test failed: unexpected event for  OPENSTATE, index:8
media.c:147: Test failed: unexpected event for  OPENSTATE, index:6
media.c:152: Test failed: unexpected event for  PLAYSTATE, index:10
media: Timeout

wvistau64_zh_CN

Vista Ultimate 64 bit Chinese+IE8 / vm2Updated on 2014/04/21. Running tests from E: drive. Added WinPcap, Silverlight, optional DirectX components, msxml4 SP3, Visual C++ 2005/2008/2010 SP1, 2012/2013/2015 runtimes. [CPU:2*kvm64 RAM:1GB disks:2*virtio eth:e1000 snd:none GPU:vga display:VNC testagentd:1.6-detached]
comctl32:
edit.c:1542: Test failed: 0: got 2, 1
edit.c:1563: Test failed: 0: got 2, 1
edit.c:1577: Test failed: 0: got 2, 1
edit.c:1591: Test failed: 0: got 2, 1
edit.c:1717: Test failed: got 1
edit.c:1718: Test failed: got 1
edit.c:1724: Test failed: got 1
edit.c:1740: Test failed: got 2
edit.c:1763: Test failed: got 1
gdi32:
font.c:6257: Test failed: 4(5): expected height 15, got 13
font.c:6260: Test failed: 4(5): expected lfHeight -12, got -11
font.c:1292: Test failed: GetCharABCWidthsA 100 - 100 should have failed
font.c:1292: Test failed: GetCharABCWidthsA ffff - ffff should have failed
font.c:1298: Test failed: GetCharABCWidthsA ff should match. codepage = 0
font.c:1298: Test failed: GetCharABCWidthsA ff should match. codepage = 134
font.c:5514: Test failed: font family names don't match: returned MingLiU, expect 細明體
font.c:5525: Test failed: MingLiU: font face names don't match: returned MingLiU, expect 細明體
font.c:5546: Test failed: MingLiU: UNIQUE ID (full name) doesn't match: returned MingLiU, expect 細明體
font.c:5514: Test failed: font family names don't match: returned MingLiU, expect 細明體
font.c:5525: Test failed: MingLiU: font face names don't match: returned MingLiU, expect 細明體
font.c:5546: Test failed: MingLiU: UNIQUE ID (full name) doesn't match: returned MingLiU, expect 細明體
font.c:5514: Test failed: font family names don't match: returned PMingLiU, expect 新細明體
font.c:5525: Test failed: PMingLiU: font face names don't match: returned PMingLiU, expect 新細明體
font.c:5546: Test failed: PMingLiU: UNIQUE ID (full name) doesn't match: returned PMingLiU, expect 新細明體
font.c:5514: Test failed: font family names don't match: returned PMingLiU, expect 新細明體
font.c:5525: Test failed: PMingLiU: font face names don't match: returned PMingLiU, expect 新細明體
font.c:5546: Test failed: PMingLiU: UNIQUE ID (full name) doesn't match: returned PMingLiU, expect 新細明體
font.c:5514: Test failed: font family names don't match: returned @MingLiU, expect @細明體
font.c:5525: Test failed: @MingLiU: font face names don't match: returned @MingLiU, expect @細明體
font.c:5546: Test failed: @MingLiU: UNIQUE ID (full name) doesn't match: returned MingLiU, expect 細明體
font.c:5514: Test failed: font family names don't match: returned @MingLiU, expect @細明體
font.c:5525: Test failed: @MingLiU: font face names don't match: returned @MingLiU, expect @細明體
font.c:5546: Test failed: @MingLiU: UNIQUE ID (full name) doesn't match: returned MingLiU, expect 細明體
font.c:5514: Test failed: font family names don't match: returned @PMingLiU, expect @新細明體
font.c:5525: Test failed: @PMingLiU: font face names don't match: returned @PMingLiU, expect @新細明體
font.c:5546: Test failed: @PMingLiU: UNIQUE ID (full name) doesn't match: returned PMingLiU, expect 新細明體
font.c:5514: Test failed: font family names don't match: returned @PMingLiU, expect @新細明體
font.c:5525: Test failed: @PMingLiU: font face names don't match: returned @PMingLiU, expect @新細明體
font.c:5546: Test failed: @PMingLiU: UNIQUE ID (full name) doesn't match: returned PMingLiU, expect 新細明體
scrrun:
filesystem.c:1530: Test failed: got L"\f8f5", expected L"\f8f5?"
filesystem.c:1659: Test failed: got L"\f8f5\fa0f", 125
filesystem.c:1806: Test failed: got L"\f8f5\fa0f", expected L"\f8f5?"
user32:
edit.c:1489: Test failed: 0: got 1, 1
edit.c:1510: Test failed: 0: got 1, 1
edit.c:1524: Test failed: 0: got 1, 1
edit.c:1538: Test failed: 0: got 1, 1
msg.c:5137: Test failed: ShowWindow(SW_RESTORE):overlapped: 18: the msg sequence is not complete: expected 0000 - actual 0088
wininet:
ftp.c:81: Test failed: Expected ERROR_INTERNET_LOGIN_FAILURE, got 12111
ftp.c:112: Test failed: InternetConnect failed : 12111
ftp.c:113: Test failed: ERROR_SUCCESS, got 12111
ftp.c:122: Test failed: Expected ERROR_INTERNET_LOGIN_FAILURE, got 12111
wmp:
media.c:147: Test failed: unexpected event for  OPENSTATE, index:6
media.c:147: Test failed: unexpected event for  OPENSTATE, index:8
media.c:147: Test failed: unexpected event for  OPENSTATE, index:6
media.c:152: Test failed: unexpected event for  PLAYSTATE, index:10

wvistau64_fr

Vista Ultimate 64 bit French+IE8 / vm2Updated on 2014/04/21. Running tests from E: drive. Added WinPcap, Silverlight, optional DirectX components, msxml4 SP3, Visual C++ 2005/2008/2010 SP1, 2012/2013/2015 runtimes. [CPU:2*kvm64 RAM:1GB disks:2*virtio eth:e1000 snd:none GPU:vga display:VNC testagentd:1.6-detached]
gdi32:
font.c:5535: Test failed: Arial: style names don't match: returned Regular, expect Normal
font.c:5535: Test failed: Arial: style names don't match: returned Regular, expect Normal
font.c:5535: Test failed: Arial: style names don't match: returned Regular, expect Normal
font.c:5535: Test failed: Arial: style names don't match: returned Regular, expect Normal
font.c:5535: Test failed: Arial: style names don't match: returned Regular, expect Normal
font.c:5535: Test failed: Arial: style names don't match: returned Regular, expect Normal
font.c:5535: Test failed: Arial: style names don't match: returned Regular, expect Normal
font.c:5535: Test failed: Arial: style names don't match: returned Regular, expect Normal
font.c:5535: Test failed: Arial: style names don't match: returned Regular, expect Normal
font.c:5525: Test failed: Arial: font face names don't match: returned Arial Italic, expect Arial Italique
font.c:5535: Test failed: Arial: style names don't match: returned Italic, expect Italique
font.c:5525: Test failed: Arial: font face names don't match: returned Arial Italic, expect Arial Italique
font.c:5535: Test failed: Arial: style names don't match: returned Italic, expect Italique
font.c:5525: Test failed: Arial: font face names don't match: returned Arial Italic, expect Arial Italique
font.c:5535: Test failed: Arial: style names don't match: returned Italic, expect Italique
font.c:5525: Test failed: Arial: font face names don't match: returned Arial Italic, expect Arial Italique
font.c:5535: Test failed: Arial: style names don't match: returned Italic, expect Italique
font.c:5525: Test failed: Arial: font face names don't match: returned Arial Italic, expect Arial Italique
font.c:5535: Test failed: Arial: style names don't match: returned Italic, expect Italique
font.c:5525: Test failed: Arial: font face names don't match: returned Arial Italic, expect Arial Italique
font.c:5535: Test failed: Arial: style names don't match: returned Italic, expect Italique
font.c:5525: Test failed: Arial: font face names don't match: returned Arial Italic, expect Arial Italique
font.c:5535: Test failed: Arial: style names don't match: returned Italic, expect Italique
font.c:5525: Test failed: Arial: font face names don't match: returned Arial Italic, expect Arial Italique
font.c:5535: Test failed: Arial: style names don't match: returned Italic, expect Italique
font.c:5525: Test failed: Arial: font face names don't match: returned Arial Bold, expect Arial Gras
font.c:5535: Test failed: Arial: style names don't match: returned Bold, expect Gras
font.c:5525: Test failed: Arial: font face names don't match: returned Arial Bold, expect Arial Gras
font.c:5535: Test failed: Arial: style names don't match: returned Bold, expect Gras
font.c:5525: Test failed: Arial: font face names don't match: returned Arial Bold, expect Arial Gras
font.c:5535: Test failed: Arial: style names don't match: returned Bold, expect Gras
font.c:5525: Test failed: Arial: font face names don't match: returned Arial Bold, expect Arial Gras
font.c:5535: Test failed: Arial: style names don't match: returned Bold, expect Gras
font.c:5525: Test failed: Arial: font face names don't match: returned Arial Bold, expect Arial Gras
font.c:5535: Test failed: Arial: style names don't match: returned Bold, expect Gras
font.c:5525: Test failed: Arial: font face names don't match: returned Arial Bold, expect Arial Gras
font.c:5535: Test failed: Arial: style names don't match: returned Bold, expect Gras
font.c:5525: Test failed: Arial: font face names don't match: returned Arial Bold, expect Arial Gras
font.c:5535: Test failed: Arial: style names don't match: returned Bold, expect Gras
font.c:5525: Test failed: Arial: font face names don't match: returned Arial Bold, expect Arial Gras
font.c:5535: Test failed: Arial: style names don't match: returned Bold, expect Gras
font.c:5525: Test failed: Arial: font face names don't match: returned Arial Bold, expect Arial Gras
font.c:5535: Test failed: Arial: style names don't match: returned Bold, expect Gras
font.c:5525: Test failed: Arial: font face names don't match: returned Arial Bold Italic, expect Arial Gras Italique
font.c:5535: Test failed: Arial: style names don't match: returned Bold Italic, expect Gras Italique
font.c:5525: Test failed: Arial: font face names don't match: returned Arial Bold Italic, expect Arial Gras Italique
font.c:5535: Test failed: Arial: style names don't match: returned Bold Italic, expect Gras Italique
font.c:5525: Test failed: Arial: font face names don't match: returned Arial Bold Italic, expect Arial Gras Italique
font.c:5535: Test failed: Arial: style names don't match: returned Bold Italic, expect Gras Italique
font.c:5525: Test failed: Arial: font face names don't match: returned Arial Bold Italic, expect Arial Gras Italique
font.c:5535: Test failed: Arial: style names don't match: returned Bold Italic, expect Gras Italique
font.c:5525: Test failed: Arial: font face names don't match: returned Arial Bold Italic, expect Arial Gras Italique
font.c:5535: Test failed: Arial: style names don't match: returned Bold Italic, expect Gras Italique
font.c:5525: Test failed: Arial: font face names don't match: returned Arial Bold Italic, expect Arial Gras Italique
font.c:5535: Test failed: Arial: style names don't match: returned Bold Italic, expect Gras Italique
font.c:5525: Test failed: Arial: font face names don't match: returned Arial Bold Italic, expect Arial Gras Italique
font.c:5535: Test failed: Arial: style names don't match: returned Bold Italic, expect Gras Italique
font.c:5525: Test failed: Arial: font face names don't match: returned Arial Bold Italic, expect Arial Gras Italique
font.c:5535: Test failed: Arial: style names don't match: returned Bold Italic, expect Gras Italique
font.c:5535: Test failed: Tahoma: style names don't match: returned Regular, expect Normal
font.c:5535: Test failed: Tahoma: style names don't match: returned Regular, expect Normal
font.c:5535: Test failed: Tahoma: style names don't match: returned Regular, expect Normal
font.c:5535: Test failed: Tahoma: style names don't match: returned Regular, expect Normal
font.c:5535: Test failed: Tahoma: style names don't match: returned Regular, expect Normal
font.c:5535: Test failed: Tahoma: style names don't match: returned Regular, expect Normal
font.c:5535: Test failed: Tahoma: style names don't match: returned Regular, expect Normal
font.c:5535: Test failed: Tahoma: style names don't match: returned Regular, expect Normal
font.c:5535: Test failed: Tahoma: style names don't match: returned Regular, expect Normal
font.c:5535: Test failed: Tahoma: style names don't match: returned Regular, expect Normal
font.c:5525: Test failed: Tahoma: font face names don't match: returned Tahoma Bold, expect Tahoma Gras
font.c:5535: Test failed: Tahoma: style names don't match: returned Bold, expect Gras
font.c:5525: Test failed: Tahoma: font face names don't match: returned Tahoma Bold, expect Tahoma Gras
font.c:5535: Test failed: Tahoma: style names don't match: returned Bold, expect Gras
font.c:5525: Test failed: Tahoma: font face names don't match: returned Tahoma Bold, expect Tahoma Gras
font.c:5535: Test failed: Tahoma: style names don't match: returned Bold, expect Gras
font.c:5525: Test failed: Tahoma: font face names don't match: returned Tahoma Bold, expect Tahoma Gras
font.c:5535: Test failed: Tahoma: style names don't match: returned Bold, expect Gras
font.c:5525: Test failed: Tahoma: font face names don't match: returned Tahoma Bold, expect Tahoma Gras
font.c:5535: Test failed: Tahoma: style names don't match: returned Bold, expect Gras
font.c:5525: Test failed: Tahoma: font face names don't match: returned Tahoma Bold, expect Tahoma Gras
font.c:5535: Test failed: Tahoma: style names don't match: returned Bold, expect Gras
font.c:5525: Test failed: Tahoma: font face names don't match: returned Tahoma Bold, expect Tahoma Gras
font.c:5535: Test failed: Tahoma: style names don't match: returned Bold, expect Gras
font.c:5525: Test failed: Tahoma: font face names don't match: returned Tahoma Bold, expect Tahoma Gras
font.c:5535: Test failed: Tahoma: style names don't match: returned Bold, expect Gras
font.c:5525: Test failed: Tahoma: font face names don't match: returned Tahoma Bold, expect Tahoma Gras
font.c:5535: Test failed: Tahoma: style names don't match: returned Bold, expect Gras
font.c:5525: Test failed: Tahoma: font face names don't match: returned Tahoma Bold, expect Tahoma Gras
font.c:5535: Test failed: Tahoma: style names don't match: returned Bold, expect Gras
font.c:5535: Test failed: Webdings: style names don't match: returned Regular, expect Normal
font.c:5535: Test failed: Wingdings: style names don't match: returned Regular, expect Normal
wmp:
media.c:147: Test failed: unexpected event for  OPENSTATE, index:6
media.c:147: Test failed: unexpected event for  OPENSTATE, index:8
media.c:147: Test failed: unexpected event for  OPENSTATE, index:6
media.c:152: Test failed: unexpected event for  PLAYSTATE, index:10

wvistau64_he

Vista Ultimate 64 bit Hebrew+IE8 / vm2Updated on 2014/04/21. Running tests from E: drive. Added WinPcap, Silverlight, optional DirectX components, msxml4 SP3, Visual C++ 2005/2008/2010 SP1, 2012/2013/2015 runtimes. [CPU:2*kvm64 RAM:1GB disks:2*virtio eth:e1000 snd:none GPU:vga display:VNC testagentd:1.6-iconized]
ddraw:
ddraw7.c:2701: Test failed: Expected message 0x46, but didn't receive it.
ddraw7.c:2703: Test failed: Expected screen size 1024x768, got 0x0.
ddraw7.c:2709: Test failed: Expected (0,0)-(1024,768), got (-8,-8)-(1032,746).
ddraw7.c:2739: Test failed: Expected (0,0)-(1024,768), got (-8,-8)-(1032,746).
ddraw7.c:2746: Test failed: Expected (0,0)-(1024,768), got (-8,-8)-(1032,746).
ddraw7.c:2772: Test failed: Expected (0,0)-(1024,768), got (-8,-8)-(1032,746).
ddraw7.c:2795: Test failed: Expected (0,0)-(1024,768), got (-8,-8)-(1032,746).
ddraw7.c:2817: Test failed: Expected (0,0)-(1024,768), got (-8,-8)-(1032,746).
ddraw7.c:2843: Test failed: Expected (0,0)-(1024,768), got (-8,-8)-(1032,746).
ddraw7.c:2863: Test failed: Expected (0,0)-(1024,768), got (-8,-8)-(1032,746).
ddraw7.c:2899: Test failed: Expected (0,0)-(1024,768), got (-8,-8)-(1032,746).
ddraw7.c:2909: Test failed: Expected (0,0)-(1024,768), got (-8,-8)-(1032,746).
ddraw7.c:2935: Test failed: Expected (0,0)-(1024,768), got (-8,-8)-(1032,746).
ddraw7.c:2958: Test failed: Expected (0,0)-(1024,768), got (-8,-8)-(1032,746).
ddraw7.c:2980: Test failed: Expected (0,0)-(1024,768), got (-8,-8)-(1032,746).
ddraw7.c:3006: Test failed: Expected (0,0)-(1024,768), got (-8,-8)-(1032,746).
ddraw7.c:3026: Test failed: Expected (0,0)-(1024,768), got (-8,-8)-(1032,746).
ddraw7.c:3063: Test failed: Expected (0,0)-(1024,768), got (-8,-8)-(1032,746).
winhttp:
winhttp.c:3121: Test failed: failed to receive response 12152
winhttp.c:3126: Test failed: failed to query status code 12019
winhttp.c:3127: Test failed: request failed unexpectedly 3735928559
wmp:
media.c:147: Test failed: unexpected event for  OPENSTATE, index:6
media.c:147: Test failed: unexpected event for  OPENSTATE, index:8
media.c:147: Test failed: unexpected event for  OPENSTATE, index:6
media.c:152: Test failed: unexpected event for  PLAYSTATE, index:10

w2008s64

Win Server 2008 Std 64-bit PU+IE9 / vm2Upgraded with Internet Explorer 9, .Net Framework 3.5 SP1 & 4.5.1 and all updates up to 2013/04/15. Added Visual C++ 2012 & 2013 runtimes. [CPU:2*kvm64 RAM:1GB disk:virtio eth:2*e1000 snd:none GPU:vga display:VNC testagentd:1.5-iconized]
ntdll:
09c4:info: unhandled exception c0000005 at 00290000
user32:
msg.c:14771: Test failed: single menu item command: 2: in msg 0x0007 expecting lParam 0x20000001 got 0x60000001
msg.c:14771: Test failed: single menu item command: 3: in msg 0x0104 expecting lParam 0x20000001 got 0x60000001
msg.c:14771: Test failed: single menu item command: 4: in msg 0x0106 expecting lParam 0x20000001 got 0x60000001

w7u

Windows 7 Ultimate Japanese+IE11 / vm1Installed Internet Explorer 11 + all updates up to 2016/07/25. Inserted the MemTest86 CD. [CPU:kvm32*2cores RAM:1.5GB disk:virtio eth:e1000 snd:ich6 GPU:cirrus display:spice testagentd:1.6-detached]
kernel32:
comm.c:859: Test failed: WaitCommEvent failed with a timeout
comm.c:880: Test failed: WaitCommEvent error 0
comm.c:881: Test failed: WaitCommEvent: expected EV_TXEMPTY, got 0
comm.c:886: Test failed: WaitCommEvent used 1513 ms for waiting

w7pro64

Windows 7 Pro 64 bit PU+IE11 / vm4Installed Internet Explorer 11 + the Platform Update + all updates up to 2014/04/15. Added .Net 4.5.1. [CPU:2*SandyBridge RAM:1GB disk:virtio eth:e1000 snd:ich6 GPU:vga display:spice testagentd:1.6-detached]
dmstyle:
dmstyle.c:459: Test failed: Got valid data 0x83, expected DMUS_OBJ_OBJECT
user32:
msg.c:12939: Test failed: 54: ShowWindow(SW_MINIMIZE): 4: in msg 0x0047 expecting wParam 0x8170 got 0x1803
msg.c:12939: Test failed: 54: ShowWindow(SW_MINIMIZE): 5: the msg 0x0003 was expected, but got msg 0x0047 instead
msg.c:12939: Test failed: 54: ShowWindow(SW_MINIMIZE): 6: the msg 0x0005 was expected, but got msg 0x0003 instead
msg.c:12939: Test failed: 54: ShowWindow(SW_MINIMIZE): 7: the msg sequence is not complete: expected 0000 - actual 0005

w8

Windows 8.1 Update + IE11 / vm4Updated 2014/04/15; added Silverlight, optional DirectX components, msxml4 SP3, Visual C++ 2005 SP1 & 2010 SP1 runtimes. [CPU:core2duo*2cores RAM:1-1.5GB disk:virtio eth:e1000 snd:ich6 GPU:vga screen:spice testagentd:1.6-detached]
d3d8:
0ae4:device: unhandled exception c0000005 at 00412B59
d3dx9_36:
include1.h(1,2): error: "wrong include"
ddraw:
d3d.c:1994: Test failed: Unexpected destination texture level pixels; 2031 differences at 0 level
d3d.c:1994: Test failed: Unexpected destination texture level pixels; 518 differences at 1 level
d3d.c:1994: Test failed: Unexpected destination texture level pixels; 138 differences at 2 level
d3d.c:1994: Test failed: Unexpected destination texture level pixels; 46 differences at 3 level
d3d.c:2178: Test failed: Unexpected destination texture level pixels; 257 differences
d3d.c:2325: Test failed: Unexpected destination texture level pixels; 256 differences at 2 level
d3d.c:2325: Test failed: Unexpected destination texture level pixels; 64 differences at 3 level
d3d.c:2325: Test failed: Unexpected destination texture level pixels; 16 differences at 4 level
d3d.c:2325: Test failed: Unexpected destination texture level pixels; 4 differences at 5 level
mmdevapi:
capture.c:181: Test failed: Position 375 expected 0

w8adm

Windows 8.1 Admin / vm4Same as w8 but without elevated privileges. Updated 2014/04/15; IE11, added Silverlight, optional DirectX components, msxml4 SP3, Visual C++ 2005 SP1 & 2010 SP1 runtimes. [CPU:core2duo*2cores RAM:1-1.5GB disk:virtio eth:e1000 snd:ich6 GPU:vga screen:spice testagentd:1.6-detached]
crypt32:
oid.c:324: Test failed: CryptUnregisterOIDFunction failed: 2
oid.c:330: Test failed: CryptUnregisterOIDFunction failed: 2
oid.c:332: Test failed: Could not delete bogus key
oid.c:341: Test failed: CryptUnregisterOIDFunction failed: 2
oid.c:348: Test failed: CryptUnregisterOIDFunction failed: 2
oid.c:352: Test failed: Could not delete CryptDllEncodeObject key
oid.c:363: Test failed: CryptUnregisterOIDFunction failed: 2
oid.c:367: Test failed: Could not delete CryptDllEncodeObject key
oid.c:370: Test failed: Could not delete 'EncodingType 3' key
oid.c:404: Test failed: Expected ERROR_FILE_EXISTS, got 00000000
oid.c:409: Test failed: Expected ERROR_FILE_EXISTS, got 00000000
oid.c:417: Test failed: Expected key to exist, RegOpenKeyA failed: 2
oid.c:442: Test failed: CryptUnregisterDefaultOIDFunction failed: 00000002
oid.c:446: Test failed: CryptUnregisterDefaultOIDFunction failed: 00000002
oid.c:460: Test failed: CryptUnregisterDefaultOIDFunction failed
sip.c:132: Test failed: CryptSIPRemoveProvider should have succeeded, last error 2
store.c:2106: Test failed: Opening just registered store at 00040000 failed, last error 2
0db4:store: unhandled exception c0000005 at 756FCB1E
d3d8:
0824:device: unhandled exception c0000005 at 00412B59
d3dx9_36:
include1.h(1,2): error: "wrong include"
ddraw:
d3d.c:1994: Test failed: Unexpected destination texture level pixels; 2031 differences at 0 level
d3d.c:1994: Test failed: Unexpected destination texture level pixels; 518 differences at 1 level
d3d.c:1994: Test failed: Unexpected destination texture level pixels; 138 differences at 2 level
d3d.c:1994: Test failed: Unexpected destination texture level pixels; 46 differences at 3 level
d3d.c:2178: Test failed: Unexpected destination texture level pixels; 257 differences
d3d.c:2325: Test failed: Unexpected destination texture level pixels; 256 differences at 2 level
d3d.c:2325: Test failed: Unexpected destination texture level pixels; 64 differences at 3 level
d3d.c:2325: Test failed: Unexpected destination texture level pixels; 16 differences at 4 level
d3d.c:2325: Test failed: Unexpected destination texture level pixels; 4 differences at 5 level
faultrep:
faultrep.c:137: Test failed: AddERExcludedApplicationA should have failed got 1
msi:
msi.c:1355: Test failed: Expected INSTALLSTATE_DEFAULT, got 1
msi.c:1367: Test failed: Expected INSTALLSTATE_DEFAULT, got 1
msi.c:1377: Test failed: Expected INSTALLSTATE_ABSENT, got -1
msi.c:1400: Test failed: Expected INSTALLSTATE_ADVERTISED, got -1
msi.c:1412: Test failed: Expected INSTALLSTATE_ADVERTISED, got -1
msi.c:1419: Test failed: Expected INSTALLSTATE_ADVERTISED, got -1
msi.c:1428: Test failed: Expected INSTALLSTATE_DEFAULT, got -1
msi.c:1473: Test failed: Expected INSTALLSTATE_DEFAULT, got 1
msi.c:1685: Test failed: Expected INSTALLSTATE_BADCONFIG, got 1
msi.c:1769: Test failed: Expected INSTALLSTATE_LOCAL, got 1
msi.c:1780: Test failed: Expected INSTALLSTATE_SOURCE, got 1
msi.c:1791: Test failed: Expected INSTALLSTATE_LOCAL, got 1
msi.c:1802: Test failed: Expected INSTALLSTATE_SOURCE, got 1
msi.c:1813: Test failed: Expected INSTALLSTATE_LOCAL, got 1
msi.c:1848: Test failed: Expected INSTALLSTATE_ADVERTISED, got -1
msi.c:1861: Test failed: Expected INSTALLSTATE_ADVERTISED, got -1
msi.c:1867: Test failed: Expected INSTALLSTATE_BADCONFIG, got -1
msi.c:1873: Test failed: Expected INSTALLSTATE_ADVERTISED, got -1
msi.c:1879: Test failed: Expected INSTALLSTATE_ADVERTISED, got -1
msi.c:1885: Test failed: Expected INSTALLSTATE_ADVERTISED, got -1
msi.c:1904: Test failed: Expected INSTALLSTATE_ADVERTISED, got -1
msi.c:1910: Test failed: Expected INSTALLSTATE_ADVERTISED, got -1
msi.c:1916: Test failed: Expected INSTALLSTATE_ADVERTISED, got -1
msi.c:1922: Test failed: Expected INSTALLSTATE_LOCAL, got -1
msi.c:1971: Test failed: Expected INSTALLSTATE_BADCONFIG, got 1
msi.c:2024: Test failed: Expected INSTALLSTATE_LOCAL, got 1
msi.c:2186: Test failed: Expected ERROR_UNKNOWN_COMPONENT, got 1605
msi.c:2187: Test failed: Expected INSTALLSTATE_UNKNOWN, got -559038737
msi.c:2201: Test failed: Expected ERROR_UNKNOWN_COMPONENT, got 1605
msi.c:2202: Test failed: Expected INSTALLSTATE_UNKNOWN, got -559038737
msi.c:2212: Test failed: Expected ERROR_SUCCESS, got 1605
msi.c:2214: Test failed: Expected INSTALLSTATE_NOTUSED or INSTALLSTATE_LOCAL, got -559038737
msi.c:2235: Test failed: Expected ERROR_SUCCESS, got 1605
msi.c:2236: Test failed: Expected INSTALLSTATE_LOCAL, got -559038737
msi.c:2247: Test failed: Expected ERROR_SUCCESS, got 1605
msi.c:2248: Test failed: Expected INSTALLSTATE_SOURCE, got -559038737
msi.c:2259: Test failed: Expected ERROR_SUCCESS, got 1605
msi.c:2260: Test failed: Expected INSTALLSTATE_LOCAL, got -559038737
msi.c:2271: Test failed: Expected ERROR_SUCCESS, got 1605
msi.c:2272: Test failed: Expected INSTALLSTATE_SOURCE, got -559038737
msi.c:2283: Test failed: Expected ERROR_SUCCESS, got 1605
msi.c:2284: Test failed: Expected INSTALLSTATE_LOCAL, got -559038737
msi.c:2331: Test failed: Expected ERROR_UNKNOWN_COMPONENT, got 1605
msi.c:2332: Test failed: Expected INSTALLSTATE_UNKNOWN, got -559038737
msi.c:2345: Test failed: Expected ERROR_UNKNOWN_COMPONENT, got 1605
msi.c:2346: Test failed: Expected INSTALLSTATE_UNKNOWN, got -559038737
msi.c:2354: Test failed: Expected ERROR_SUCCESS, got 1605
msi.c:2355: Test failed: Expected INSTALLSTATE_NOTUSED or INSTALLSTATE_LOCAL, got -559038737
msi.c:2363: Test failed: Expected ERROR_SUCCESS, got 1605
msi.c:2364: Test failed: Expected INSTALLSTATE_LOCAL, got -559038737
msi.c:2397: Test failed: Expected ERROR_UNKNOWN_COMPONENT, got 1605
msi.c:2398: Test failed: Expected INSTALLSTATE_UNKNOWN, got -559038737
msi.c:2417: Test failed: Expected ERROR_SUCCESS, got 1605
msi.c:2418: Test failed: Expected INSTALLSTATE_LOCAL, got -559038737
msi.c:2534: Test failed: Expected INSTALLSTATE_ABSENT, got -1
msi.c:2535: Test failed: Expected C:\imapath, got 
msi.c:2536: Test failed: Expected 10, got 260
msi.c:2541: Test failed: Expected INSTALLSTATE_ABSENT, got -1
msi.c:2542: Test failed: Expected C:\imapath, got 
msi.c:2543: Test failed: Expected 10, got 260
msi.c:2561: Test failed: Expected INSTALLSTATE_ABSENT, got -1
msi.c:2562: Test failed: Expected C:\imapath, got 
msi.c:2563: Test failed: Expected 10, got 260
msi.c:2568: Test failed: Expected INSTALLSTATE_ABSENT, got -1
msi.c:2569: Test failed: Expected C:\imapath, got 
msi.c:2570: Test failed: Expected 10, got 260
msi.c:2578: Test failed: Expected INSTALLSTATE_MOREDATA, got -1
msi.c:2580: Test failed: Expected 10, got 0
msi.c:2585: Test failed: Expected INSTALLSTATE_LOCAL, got -1
msi.c:2586: Test failed: Expected C:\imapath, got 
msi.c:2587: Test failed: Expected 10, got 260
msi.c:2592: Test failed: Expected INSTALLSTATE_MOREDATA, got -1
msi.c:2594: Test failed: Expected 10, got 0
msi.c:2599: Test failed: Expected INSTALLSTATE_LOCAL, got -1
msi.c:2600: Test failed: Expected C:\imapath, got 
msi.c:2601: Test failed: Expected 10, got 260
msi.c:2638: Test failed: Expected INSTALLSTATE_ABSENT, got -1
msi.c:2639: Test failed: Expected C:\imapath, got 
msi.c:2640: Test failed: Expected 10, got 260
msi.c:2645: Test failed: Expected INSTALLSTATE_ABSENT, got -1
msi.c:2646: Test failed: Expected C:\imapath, got 
msi.c:2647: Test failed: Expected 10, got 260
msi.c:2665: Test failed: Expected INSTALLSTATE_ABSENT, got -1
msi.c:2666: Test failed: Expected C:\imapath, got 
msi.c:2667: Test failed: Expected 10, got 260
msi.c:2672: Test failed: Expected INSTALLSTATE_ABSENT, got -1
msi.c:2673: Test failed: Expected C:\imapath, got 
msi.c:2674: Test failed: Expected 10, got 260
msi.c:2682: Test failed: Expected INSTALLSTATE_LOCAL, got -1
msi.c:2683: Test failed: Expected C:\imapath, got 
msi.c:2684: Test failed: Expected 10, got 260
msi.c:2689: Test failed: Expected INSTALLSTATE_LOCAL, got -1
msi.c:2690: Test failed: Expected C:\imapath, got 
msi.c:2691: Test failed: Expected 10, got 260
msi.c:2748: Test failed: Expected INSTALLSTATE_ABSENT, got -1
msi.c:2749: Test failed: Expected C:\imapath, got 
msi.c:2750: Test failed: Expected 10, got 260
msi.c:2755: Test failed: Expected INSTALLSTATE_ABSENT, got -1
msi.c:2756: Test failed: Expected C:\imapath, got 
msi.c:2757: Test failed: Expected 10, got 260
msi.c:2775: Test failed: Expected INSTALLSTATE_ABSENT, got -1
msi.c:2776: Test failed: Expected C:\imapath, got 
msi.c:2777: Test failed: Expected 10, got 260
msi.c:2782: Test failed: Expected INSTALLSTATE_ABSENT, got -1
msi.c:2783: Test failed: Expected C:\imapath, got 
msi.c:2784: Test failed: Expected 10, got 260
msi.c:2792: Test failed: Expected INSTALLSTATE_LOCAL, got -1
msi.c:2793: Test failed: Expected C:\imapath, got 
msi.c:2794: Test failed: Expected 10, got 260
msi.c:2799: Test failed: Expected INSTALLSTATE_LOCAL, got -1
msi.c:2800: Test failed: Expected C:\imapath, got 
msi.c:2801: Test failed: Expected 10, got 260
msi.c:2857: Test failed: Expected INSTALLSTATE_ABSENT, got -1
msi.c:2858: Test failed: Expected C:\imapath, got 
msi.c:2859: Test failed: Expected 10, got 260
msi.c:2864: Test failed: Expected INSTALLSTATE_ABSENT, got -1
msi.c:2865: Test failed: Expected C:\imapath, got 
msi.c:2866: Test failed: Expected 10, got 260
msi.c:2874: Test failed: Expected INSTALLSTATE_LOCAL, got -1
msi.c:2875: Test failed: Expected C:\imapath, got 
msi.c:2876: Test failed: Expected 10, got 260
msi.c:2881: Test failed: Expected INSTALLSTATE_LOCAL, got -1
msi.c:2882: Test failed: Expected C:\imapath, got 
msi.c:2883: Test failed: Expected 10, got 260
msi.c:2934: Test failed: Expected INSTALLSTATE_ABSENT, got -1
msi.c:2935: Test failed: Expected C:\imapath, got 
msi.c:2936: Test failed: Expected 10, got 260
msi.c:2941: Test failed: Expected INSTALLSTATE_ABSENT, got -1
msi.c:2942: Test failed: Expected C:\imapath, got 
msi.c:2943: Test failed: Expected 10, got 260
msi.c:2951: Test failed: Expected INSTALLSTATE_LOCAL, got -1
msi.c:2952: Test failed: Expected C:\imapath, got 
msi.c:2953: Test failed: Expected 10, got 260
msi.c:2958: Test failed: Expected INSTALLSTATE_LOCAL, got -1
msi.c:2959: Test failed: Expected C:\imapath, got 
msi.c:2960: Test failed: Expected 10, got 260
msi.c:3055: Test failed: got -1
msi.c:3056: Test failed: got 
msi.c:3057: Test failed: got 0
msi.c:3075: Test failed: got -1
msi.c:3076: Test failed: got 
msi.c:3077: Test failed: got 0
msi.c:3085: Test failed: got -1
msi.c:3087: Test failed: got 0
msi.c:3092: Test failed: got -1
msi.c:3093: Test failed: got 
msi.c:3094: Test failed: got 0
msi.c:3138: Test failed: got -1
msi.c:3139: Test failed: got 
msi.c:3140: Test failed: got 0
msi.c:3148: Test failed: got -1
msi.c:3149: Test failed: got 
msi.c:3150: Test failed: got 0
msi.c:3194: Test failed: got -1
msi.c:3195: Test failed: got 
msi.c:3196: Test failed: got 0
msi.c:3214: Test failed: got -1
msi.c:3215: Test failed: got 
msi.c:3216: Test failed: got 0
msi.c:3224: Test failed: got -1
msi.c:3225: Test failed: got 
msi.c:3226: Test failed: got 0
msi.c:3269: Test failed: got -1
msi.c:3270: Test failed: got 
msi.c:3271: Test failed: got 0
msi.c:3279: Test failed: got -1
msi.c:3280: Test failed: got 
msi.c:3281: Test failed: got 0
msi.c:3620: Test failed: Expected ERROR_SUCCESS, got 1607
msi.c:3621: Test failed: Expected {B99479FE-2D76-42BC-A7E2-C782556257F8}, got prod
msi.c:3638: Test failed: Expected ERROR_SUCCESS, got 1607
msi.c:3639: Test failed: Expected {B99479FE-2D76-42BC-A7E2-C782556257F8}, got prod
msi.c:3653: Test failed: Expected ERROR_SUCCESS, got 1607
msi.c:3654: Test failed: Expected {B99479FE-2D76-42BC-A7E2-C782556257F8}, got prod
msi.c:3668: Test failed: Expected ERROR_SUCCESS, got 1607
msi.c:3669: Test failed: Expected {B99479FE-2D76-42BC-A7E2-C782556257F8}, got prod
msi.c:3686: Test failed: Expected ERROR_SUCCESS, got 1607
msi.c:3687: Test failed: Expected {B62CF9AF-C681-4CCF-8F8C-2291B545DF89}, got prod
msi.c:3715: Test failed: Expected ERROR_SUCCESS, got 1607
msi.c:3716: Test failed: Expected {B99479FE-2D76-42BC-A7E2-C782556257F8}, got prod
msi.c:3733: Test failed: Expected ERROR_SUCCESS, got 1607
msi.c:3734: Test failed: Expected {B99479FE-2D76-42BC-A7E2-C782556257F8}, got prod
msi.c:3748: Test failed: Expected ERROR_SUCCESS, got 1607
msi.c:3749: Test failed: Expected {B99479FE-2D76-42BC-A7E2-C782556257F8}, got prod
msi.c:3763: Test failed: Expected ERROR_SUCCESS, got 1607
msi.c:3764: Test failed: Expected {B99479FE-2D76-42BC-A7E2-C782556257F8}, got prod
msi.c:3781: Test failed: Expected ERROR_SUCCESS, got 1607
msi.c:3782: Test failed: Expected {B62CF9AF-C681-4CCF-8F8C-2291B545DF89}, got prod
msi.c:3864: Test failed: Expected ERROR_INVALID_PARAMETER, got 259
msi.c:3872: Test failed: Expected ERROR_SUCCESS, got 1607
msi.c:3873: Test failed: Expected {3DC26AC6-EB04-4DB4-A691-106A42C07AFD}, got 
msi.c:3878: Test failed: Expected ERROR_SUCCESS, got 1607
msi.c:3879: Test failed: Expected {3DC26AC6-EB04-4DB4-A691-106A42C07AFD}, got 
msi.c:3884: Test failed: Expected ERROR_NO_MORE_ITEMS, got 87
msi.c:3902: Test failed: Expected ERROR_SUCCESS, got 1607
msi.c:3903: Test failed: Expected {3DC26AC6-EB04-4DB4-A691-106A42C07AFD} or {62FB7EE0-4926-4676-A209-92D69272A00A}, got 
msi.c:3909: Test failed: Expected ERROR_SUCCESS, got 87
msi.c:3910: Test failed: Expected {3DC26AC6-EB04-4DB4-A691-106A42C07AFD} or {62FB7EE0-4926-4676-A209-92D69272A00A}, got 
msi.c:3943: Test failed: Expected ERROR_SUCCESS, got 1607
msi.c:3944: Test failed: Expected {3DC26AC6-EB04-4DB4-A691-106A42C07AFD}, got 
msi.c:3949: Test failed: Expected ERROR_SUCCESS, got 1607
msi.c:3954: Test failed: Expected ERROR_NO_MORE_ITEMS, got 87
msi.c:3972: Test failed: Expected ERROR_SUCCESS, got 1607
msi.c:3973: Test failed: Expected {3DC26AC6-EB04-4DB4-A691-106A42C07AFD} or {62FB7EE0-4926-4676-A209-92D69272A00A}, got 
msi.c:3979: Test failed: Expected ERROR_SUCCESS, got 87
msi.c:3980: Test failed: Expected {3DC26AC6-EB04-4DB4-A691-106A42C07AFD} or {62FB7EE0-4926-4676-A209-92D69272A00A}, got 
msi.c:4421: Test failed: Expected ERROR_UNKNOWN_PROPERTY, got 1605
msi.c:4464: Test failed: Expected ERROR_UNKNOWN_PROPERTY, got 1605
msi.c:4476: Test failed: Expected ERROR_SUCCESS, got 1605
msi.c:4477: Test failed: Expected "", got "apple"
msi.c:4478: Test failed: Expected 0, got 260
msi.c:4487: Test failed: Expected ERROR_SUCCESS, got 1605
msi.c:4488: Test failed: Expected "link", got "apple"
msi.c:4489: Test failed: Expected 4, got 260
msi.c:4493: Test failed: Expected ERROR_SUCCESS, got 1605
msi.c:4498: Test failed: Expected ERROR_SUCCESS, got 1605
msi.c:4499: Test failed: Expected 4, got 260
msi.c:4504: Test failed: Expected ERROR_SUCCESS, got 1605
msi.c:4505: Test failed: Expected 4, got 2
msi.c:4512: Test failed: Expected ERROR_MORE_DATA, got 1605
msi.c:4513: Test failed: Expected 4, got 2
msi.c:4519: Test failed: Expected ERROR_MORE_DATA, got 1605
msi.c:4584: Test failed: Expected ERROR_SUCCESS, got 1608
msi.c:4585: Test failed: Expected "", got "apple"
msi.c:4586: Test failed: Expected 0, got 260
msi.c:4595: Test failed: Expected ERROR_SUCCESS, got 1608
msi.c:4596: Test failed: Expected "link", got "apple"
msi.c:4597: Test failed: Expected 4, got 260
msi.c:4679: Test failed: Expected ERROR_SUCCESS, got 1608
msi.c:4680: Test failed: Expected "", got "apple"
msi.c:4681: Test failed: Expected 0, got 260
msi.c:4690: Test failed: Expected ERROR_SUCCESS, got 1608
msi.c:4691: Test failed: Expected "link", got "apple"
msi.c:4692: Test failed: Expected 4, got 260
msi.c:4702: Test failed: Expected ERROR_SUCCESS, got 1608
msi.c:4703: Test failed: Expected "42", got "apple"
msi.c:4704: Test failed: Expected 2, got 260
msi.c:4713: Test failed: Expected ERROR_SUCCESS, got 1608
msi.c:4714: Test failed: Expected "name", got "apple"
msi.c:4715: Test failed: Expected 4, got 260
msi.c:4725: Test failed: Expected ERROR_SUCCESS, got 1608
msi.c:4726: Test failed: Expected "42", got "apple"
msi.c:4727: Test failed: Expected 2, got 260
msi.c:4736: Test failed: Expected ERROR_SUCCESS, got 1608
msi.c:4737: Test failed: Expected "1.1.1", got "apple"
msi.c:4738: Test failed: Expected 5, got 260
msi.c:4748: Test failed: Expected ERROR_SUCCESS, got 1608
msi.c:4749: Test failed: Expected "42", got "apple"
msi.c:4750: Test failed: Expected 2, got 260
msi.c:4759: Test failed: Expected ERROR_SUCCESS, got 1608
msi.c:4760: Test failed: Expected "tele", got "apple"
msi.c:4761: Test failed: Expected 4, got 260
msi.c:4771: Test failed: Expected ERROR_SUCCESS, got 1608
msi.c:4772: Test failed: Expected "42", got "apple"
msi.c:4773: Test failed: Expected 2, got 260
msi.c:4782: Test failed: Expected ERROR_SUCCESS, got 1608
msi.c:4783: Test failed: Expected "loc", got "apple"
msi.c:4784: Test failed: Expected 3, got 260
msi.c:4794: Test failed: Expected ERROR_SUCCESS, got 1608
msi.c:4795: Test failed: Expected "42", got "apple"
msi.c:4796: Test failed: Expected 2, got 260
msi.c:4805: Test failed: Expected ERROR_SUCCESS, got 1608
msi.c:4806: Test failed: Expected "source", got "apple"
msi.c:4807: Test failed: Expected 6, got 260
msi.c:4817: Test failed: Expected ERROR_SUCCESS, got 1608
msi.c:4818: Test failed: Expected "42", got "apple"
msi.c:4819: Test failed: Expected 2, got 260
msi.c:4828: Test failed: Expected ERROR_SUCCESS, got 1608
msi.c:4829: Test failed: Expected "date", got "apple"
msi.c:4830: Test failed: Expected 4, got 260
msi.c:4840: Test failed: Expected ERROR_SUCCESS, got 1608
msi.c:4841: Test failed: Expected "42", got "apple"
msi.c:4842: Test failed: Expected 2, got 260
msi.c:4851: Test failed: Expected ERROR_SUCCESS, got 1608
msi.c:4852: Test failed: Expected "pub", got "apple"
msi.c:4853: Test failed: Expected 3, got 260
msi.c:4863: Test failed: Expected ERROR_SUCCESS, got 1608
msi.c:4864: Test failed: Expected "42", got "apple"
msi.c:4865: Test failed: Expected 2, got 260
msi.c:4874: Test failed: Expected ERROR_SUCCESS, got 1608
msi.c:4875: Test failed: Expected "pack", got "apple"
msi.c:4876: Test failed: Expected 4, got 260
msi.c:4886: Test failed: Expected ERROR_SUCCESS, got 1608
msi.c:4887: Test failed: Expected "42", got "apple"
msi.c:4888: Test failed: Expected 2, got 260
msi.c:4897: Test failed: Expected ERROR_SUCCESS, got 1608
msi.c:4898: Test failed: Expected "about", got "apple"
msi.c:4899: Test failed: Expected 5, got 260
msi.c:4909: Test failed: Expected ERROR_SUCCESS, got 1608
msi.c:4910: Test failed: Expected "42", got "apple"
msi.c:4911: Test failed: Expected 2, got 260
msi.c:4920: Test failed: Expected ERROR_SUCCESS, got 1608
msi.c:4921: Test failed: Expected "info", got "apple"
msi.c:4922: Test failed: Expected 4, got 260
msi.c:4932: Test failed: Expected ERROR_SUCCESS, got 1608
msi.c:4933: Test failed: Expected "42", got "apple"
msi.c:4934: Test failed: Expected 2, got 260
msi.c:4943: Test failed: Expected ERROR_SUCCESS, got 1608
msi.c:4944: Test failed: Expected "1", got "apple"
msi.c:4945: Test failed: Expected 1, got 260
msi.c:4955: Test failed: Expected ERROR_SUCCESS, got 1608
msi.c:4956: Test failed: Expected "42", got "apple"
msi.c:4957: Test failed: Expected 2, got 260
msi.c:4966: Test failed: Expected ERROR_SUCCESS, got 1608
msi.c:4967: Test failed: Expected "1", got "apple"
msi.c:4968: Test failed: Expected 1, got 260
msi.c:4978: Test failed: Expected ERROR_SUCCESS, got 1608
msi.c:4979: Test failed: Expected "42", got "apple"
msi.c:4980: Test failed: Expected 2, got 260
msi.c:4989: Test failed: Expected ERROR_SUCCESS, got 1608
msi.c:4990: Test failed: Expected "id", got "apple"
msi.c:4991: Test failed: Expected 2, got 260
msi.c:5001: Test failed: Expected ERROR_SUCCESS, got 1608
msi.c:5002: Test failed: Expected "42", got "apple"
msi.c:5003: Test failed: Expected 2, got 260
msi.c:5012: Test failed: Expected ERROR_SUCCESS, got 1608
msi.c:5013: Test failed: Expected "comp", got "apple"
msi.c:5014: Test failed: Expected 4, got 260
msi.c:5024: Test failed: Expected ERROR_SUCCESS, got 1608
msi.c:5025: Test failed: Expected "42", got "apple"
msi.c:5026: Test failed: Expected 2, got 260
msi.c:5035: Test failed: Expected ERROR_SUCCESS, got 1608
msi.c:5036: Test failed: Expected "own", got "apple"
msi.c:5037: Test failed: Expected 3, got 260
msi.c:5047: Test failed: Expected ERROR_SUCCESS, got 1608
msi.c:5048: Test failed: Expected "42", got "apple"
msi.c:5049: Test failed: Expected 2, got 260
msi.c:5773: Test failed: Expected ERROR_SUCCESS, got 1605
msi.c:5774: Test failed: Expected "5", got "apple"
msi.c:5775: Test failed: Expected 1, got 260
msi.c:5799: Test failed: Expected ERROR_SUCCESS, got 1605
msi.c:5800: Test failed: Expected "", got "apple"
msi.c:5801: Test failed: Expected 0, got 260
msi.c:5812: Test failed: Expected ERROR_SUCCESS, got 1605
msi.c:5813: Test failed: Expected "link", got "apple"
msi.c:5814: Test failed: Expected 4, got 260
msi.c:5825: Test failed: Expected ERROR_SUCCESS, got 1605
msi.c:5826: Test failed: Expected "phone", got "apple"
msi.c:5827: Test failed: Expected 5, got 260
msi.c:5833: Test failed: Expected ERROR_SUCCESS, got 1605
msi.c:5841: Test failed: Expected ERROR_MORE_DATA, got 1605
msi.c:5843: Test failed: Expected 10, got 5
msi.c:5850: Test failed: Expected ERROR_SUCCESS, got 1605
msi.c:5851: Test failed: Expected 10, got 5
msi.c:5858: Test failed: Expected ERROR_SUCCESS, got 1605
msi.c:5859: Test failed: Expected 10, got 260
msi.c:5867: Test failed: Expected ERROR_MORE_DATA, got 1605
msi.c:5870: Test failed: Expected 10, got 0
msi.c:5881: Test failed: Expected ERROR_UNKNOWN_PROPERTY, got 1605
msi.c:5895: Test failed: Expected ERROR_SUCCESS, got 1605
msi.c:5896: Test failed: Expected "date", got "apple"
msi.c:5897: Test failed: Expected 4, got 260
msi.c:5908: Test failed: Expected ERROR_SUCCESS, got 1605
msi.c:5909: Test failed: Expected "name", got "apple"
msi.c:5910: Test failed: Expected 4, got 260
msi.c:5921: Test failed: Expected ERROR_SUCCESS, got 1605
msi.c:5922: Test failed: Expected "loc", got "apple"
msi.c:5923: Test failed: Expected 3, got 260
msi.c:5934: Test failed: Expected ERROR_SUCCESS, got 1605
msi.c:5935: Test failed: Expected "source", got "apple"
msi.c:5936: Test failed: Expected 6, got 260
msi.c:5947: Test failed: Expected ERROR_SUCCESS, got 1605
msi.c:5948: Test failed: Expected "local", got "apple"
msi.c:5949: Test failed: Expected 5, got 260
msi.c:5960: Test failed: Expected ERROR_SUCCESS, got 1605
msi.c:5961: Test failed: Expected "pub", got "apple"
msi.c:5962: Test failed: Expected 3, got 260
msi.c:5973: Test failed: Expected ERROR_SUCCESS, got 1605
msi.c:5974: Test failed: Expected "about", got "apple"
msi.c:5975: Test failed: Expected 5, got 260
msi.c:5986: Test failed: Expected ERROR_SUCCESS, got 1605
msi.c:5987: Test failed: Expected "update", got "apple"
msi.c:5988: Test failed: Expected 6, got 260
msi.c:5999: Test failed: Expected ERROR_SUCCESS, got 1605
msi.c:6000: Test failed: Expected "2", got "apple"
msi.c:6001: Test failed: Expected 1, got 260
msi.c:6012: Test failed: Expected ERROR_SUCCESS, got 1605
msi.c:6013: Test failed: Expected "3", got "apple"
msi.c:6014: Test failed: Expected 1, got 260
msi.c:6025: Test failed: Expected ERROR_SUCCESS, got 1605
msi.c:6026: Test failed: Expected "3.2.1", got "apple"
msi.c:6027: Test failed: Expected 5, got 260
msi.c:6038: Test failed: Expected ERROR_SUCCESS, got 1605
msi.c:6039: Test failed: Expected "id", got "apple"
msi.c:6040: Test failed: Expected 2, got 260
msi.c:6051: Test failed: Expected ERROR_SUCCESS, got 1605
msi.c:6052: Test failed: Expected "comp", got "apple"
msi.c:6053: Test failed: Expected 4, got 260
msi.c:6064: Test failed: Expected ERROR_SUCCESS, got 1605
msi.c:6065: Test failed: Expected "owner", got "apple"
msi.c:6066: Test failed: Expected 5, got 260
msi.c:6697: Test failed: Expected ERROR_SUCCESS, got 1605
msi.c:6698: Test failed: Expected "5", got "apple"
msi.c:6699: Test failed: Expected 1, got 260
msi.c:6710: Test failed: Expected ERROR_SUCCESS, got 1605
msi.c:6711: Test failed: Expected "link", got "apple"
msi.c:6712: Test failed: Expected 4, got 260
msi.c:6723: Test failed: Expected ERROR_SUCCESS, got 1605
msi.c:6724: Test failed: Expected "phone", got "apple"
msi.c:6725: Test failed: Expected 5, got 260
msi.c:6736: Test failed: Expected ERROR_SUCCESS, got 1605
msi.c:6737: Test failed: Expected "date", got "apple"
msi.c:6738: Test failed: Expected 4, got 260
msi.c:6749: Test failed: Expected ERROR_SUCCESS, got 1605
msi.c:6750: Test failed: Expected "name", got "apple"
msi.c:6751: Test failed: Expected 4, got 260
msi.c:6762: Test failed: Expected ERROR_SUCCESS, got 1605
msi.c:6763: Test failed: Expected "loc", got "apple"
msi.c:6764: Test failed: Expected 3, got 260
msi.c:6775: Test failed: Expected ERROR_SUCCESS, got 1605
msi.c:6776: Test failed: Expected "source", got "apple"
msi.c:6777: Test failed: Expected 6, got 260
msi.c:6788: Test failed: Expected ERROR_SUCCESS, got 1605
msi.c:6789: Test failed: Expected "local", got "apple"
msi.c:6790: Test failed: Expected 5, got 260
msi.c:6801: Test failed: Expected ERROR_SUCCESS, got 1605
msi.c:6802: Test failed: Expected "pub", got "apple"
msi.c:6803: Test failed: Expected 3, got 260
msi.c:6814: Test failed: Expected ERROR_SUCCESS, got 1605
msi.c:6815: Test failed: Expected "about", got "apple"
msi.c:6816: Test failed: Expected 5, got 260
msi.c:6827: Test failed: Expected ERROR_SUCCESS, got 1605
msi.c:6828: Test failed: Expected "update", got "apple"
msi.c:6829: Test failed: Expected 6, got 260
msi.c:6840: Test failed: Expected ERROR_SUCCESS, got 1605
msi.c:6841: Test failed: Expected "2", got "apple"
msi.c:6842: Test failed: Expected 1, got 260
msi.c:6853: Test failed: Expected ERROR_SUCCESS, got 1605
msi.c:6854: Test failed: Expected "3", got "apple"
msi.c:6855: Test failed: Expected 1, got 260
msi.c:6866: Test failed: Expected ERROR_SUCCESS, got 1605
msi.c:6867: Test failed: Expected "3.2.1", got "apple"
msi.c:6868: Test failed: Expected 5, got 260
msi.c:6879: Test failed: Expected ERROR_SUCCESS, got 1605
msi.c:6880: Test failed: Expected "id", got "apple"
msi.c:6881: Test failed: Expected 2, got 260
msi.c:6892: Test failed: Expected ERROR_SUCCESS, got 1605
msi.c:6893: Test failed: Expected "comp", got "apple"
msi.c:6894: Test failed: Expected 4, got 260
msi.c:6905: Test failed: Expected ERROR_SUCCESS, got 1605
msi.c:6906: Test failed: Expected "owner", got "apple"
msi.c:6907: Test failed: Expected 5, got 260
msi.c:7082: Test failed: Expected ERROR_SUCCESS, got 1605
msi.c:7083: Test failed: Expected "1", got "apple"
msi.c:7084: Test failed: Expected 1, got 260
msi.c:7137: Test failed: Expected ERROR_UNKNOWN_PROPERTY, got 1605
msi.c:7151: Test failed: Expected ERROR_UNKNOWN_PROPERTY, got 1605
msi.c:7165: Test failed: Expected ERROR_UNKNOWN_PROPERTY, got 1605
msi.c:7179: Test failed: Expected ERROR_UNKNOWN_PROPERTY, got 1605
msi.c:7193: Test failed: Expected ERROR_UNKNOWN_PROPERTY, got 1605
msi.c:7207: Test failed: Expected ERROR_UNKNOWN_PROPERTY, got 1605
msi.c:7221: Test failed: Expected ERROR_UNKNOWN_PROPERTY, got 1605
msi.c:7235: Test failed: Expected ERROR_UNKNOWN_PROPERTY, got 1605
msi.c:7249: Test failed: Expected ERROR_UNKNOWN_PROPERTY, got 1605
msi.c:7263: Test failed: Expected ERROR_UNKNOWN_PROPERTY, got 1605
msi.c:7277: Test failed: Expected ERROR_UNKNOWN_PROPERTY, got 1605
msi.c:7291: Test failed: Expected ERROR_UNKNOWN_PROPERTY, got 1605
msi.c:7305: Test failed: Expected ERROR_UNKNOWN_PROPERTY, got 1605
msi.c:7319: Test failed: Expected ERROR_UNKNOWN_PROPERTY, got 1605
msi.c:7333: Test failed: Expected ERROR_UNKNOWN_PROPERTY, got 1605
msi.c:7347: Test failed: Expected ERROR_UNKNOWN_PROPERTY, got 1605
msi.c:7361: Test failed: Expected ERROR_SUCCESS, got 1605
msi.c:7362: Test failed: Expected "trans", got "apple"
msi.c:7363: Test failed: Expected 5, got 260
msi.c:7374: Test failed: Expected ERROR_SUCCESS, got 1605
msi.c:7375: Test failed: Expected "lang", got "apple"
msi.c:7376: Test failed: Expected 4, got 260
msi.c:7387: Test failed: Expected ERROR_SUCCESS, got 1605
msi.c:7388: Test failed: Expected "name", got "apple"
msi.c:7389: Test failed: Expected 4, got 260
msi.c:7402: Test failed: Expected ERROR_SUCCESS, got 1605
msi.c:7403: Test failed: Expected "", got "apple"
msi.c:7404: Test failed: Expected 0, got 260
msi.c:7419: Test failed: Expected ERROR_BAD_CONFIGURATION, got 1605
msi.c:7434: Test failed: Expected ERROR_SUCCESS, got 1605
msi.c:7435: Test failed: Expected "ver", got "apple"
msi.c:7436: Test failed: Expected 3, got 260
msi.c:7447: Test failed: Expected ERROR_SUCCESS, got 1605
msi.c:7448: Test failed: Expected "icon", got "apple"
msi.c:7449: Test failed: Expected 4, got 260
msi.c:7477: Test failed: Expected ERROR_SUCCESS, got 1605
msi.c:7478: Test failed: Expected "auth", got "apple"
msi.c:7479: Test failed: Expected 4, got 260
msi.c:7564: Test failed: Expected ERROR_SUCCESS, got 1605
msi.c:7565: Test failed: Expected "5", got "apple"
msi.c:7566: Test failed: Expected 1, got 260
msi.c:7577: Test failed: Expected ERROR_SUCCESS, got 1605
msi.c:7578: Test failed: Expected "link", got "apple"
msi.c:7579: Test failed: Expected 4, got 260
msi.c:7590: Test failed: Expected ERROR_SUCCESS, got 1605
msi.c:7591: Test failed: Expected "phone", got "apple"
msi.c:7592: Test failed: Expected 5, got 260
msi.c:7603: Test failed: Expected ERROR_SUCCESS, got 1605
msi.c:7604: Test failed: Expected "date", got "apple"
msi.c:7605: Test failed: Expected 4, got 260
msi.c:7616: Test failed: Expected ERROR_SUCCESS, got 1605
msi.c:7617: Test failed: Expected "name", got "apple"
msi.c:7618: Test failed: Expected 4, got 260
msi.c:7629: Test failed: Expected ERROR_SUCCESS, got 1605
msi.c:7630: Test failed: Expected "loc", got "apple"
msi.c:7631: Test failed: Expected 3, got 260
msi.c:7642: Test failed: Expected ERROR_SUCCESS, got 1605
msi.c:7643: Test failed: Expected "source", got "apple"
msi.c:7644: Test failed: Expected 6, got 260
msi.c:7655: Test failed: Expected ERROR_SUCCESS, got 1605
msi.c:7656: Test failed: Expected "local", got "apple"
msi.c:7657: Test failed: Expected 5, got 260
msi.c:7668: Test failed: Expected ERROR_SUCCESS, got 1605
msi.c:7669: Test failed: Expected "pub", got "apple"
msi.c:7670: Test failed: Expected 3, got 260
msi.c:7681: Test failed: Expected ERROR_SUCCESS, got 1605
msi.c:7682: Test failed: Expected "about", got "apple"
msi.c:7683: Test failed: Expected 5, got 260
msi.c:7694: Test failed: Expected ERROR_SUCCESS, got 1605
msi.c:7695: Test failed: Expected "update", got "apple"
msi.c:7696: Test failed: Expected 6, got 260
msi.c:7707: Test failed: Expected ERROR_SUCCESS, got 1605
msi.c:7708: Test failed: Expected "2", got "apple"
msi.c:7709: Test failed: Expected 1, got 260
msi.c:7720: Test failed: Expected ERROR_SUCCESS, got 1605
msi.c:7721: Test failed: Expected "3", got "apple"
msi.c:7722: Test failed: Expected 1, got 260
msi.c:7733: Test failed: Expected ERROR_SUCCESS, got 1605
msi.c:7734: Test failed: Expected "3.2.1", got "apple"
msi.c:7735: Test failed: Expected 5, got 260
msi.c:7746: Test failed: Expected ERROR_SUCCESS, got 1605
msi.c:7747: Test failed: Expected "id", got "apple"
msi.c:7748: Test failed: Expected 2, got 260
msi.c:7759: Test failed: Expected ERROR_SUCCESS, got 1605
msi.c:7760: Test failed: Expected "comp", got "apple"
msi.c:7761: Test failed: Expected 4, got 260
msi.c:7772: Test failed: Expected ERROR_SUCCESS, got 1605
msi.c:7773: Test failed: Expected "owner", got "apple"
msi.c:7774: Test failed: Expected 5, got 260
msi.c:8539: Test failed: Expected USERINFOSTATE_ABSENT, got -1
msi.c:8569: Test failed: Expected USERINFOSTATE_ABSENT, got -1
msi.c:8574: Test failed: Expected MAX_PATH - 1, got 260
msi.c:8581: Test failed: Expected USERINFOSTATE_ABSENT, got -1
msi.c:8583: Test failed: Expected empty string, got "orange"
msi.c:8585: Test failed: Expected 0, got 260
msi.c:8586: Test failed: Expected MAX_PATH - 1, got 260
msi.c:8591: Test failed: Expected USERINFOSTATE_ABSENT, got -1
msi.c:8594: Test failed: Expected MAX_PATH - 1, got 260
msi.c:8602: Test failed: Expected USERINFOSTATE_ABSENT, got -1
msi.c:8604: Test failed: Expected "owner", got "apple"
msi.c:8605: Test failed: Expected empty string, got "orange"
msi.c:8607: Test failed: Expected 5, got 260
msi.c:8608: Test failed: Expected 0, got 260
msi.c:8609: Test failed: Expected MAX_PATH - 1, got 260
msi.c:8617: Test failed: Expected USERINFOSTATE_ABSENT, got -1
msi.c:8619: Test failed: Expected "owner", got "apple"
msi.c:8620: Test failed: Expected "company", got "orange"
msi.c:8622: Test failed: Expected 5, got 260
msi.c:8623: Test failed: Expected 7, got 260
msi.c:8624: Test failed: Expected MAX_PATH - 1, got 260
msi.c:8632: Test failed: Expected USERINFOSTATE_PRESENT, got -1
msi.c:8634: Test failed: Expected "owner", got "apple"
msi.c:8635: Test failed: Expected "company", got "orange"
msi.c:8636: Test failed: Expected "ID", got "banana"
msi.c:8637: Test failed: Expected 5, got 260
msi.c:8638: Test failed: Expected 7, got 260
msi.c:8639: Test failed: Expected 2, got 260
msi.c:8645: Test failed: Expected USERINFOSTATE_MOREDATA, got -1
msi.c:8650: Test failed: Expected 5, got 0
msi.c:8658: Test failed: Expected USERINFOSTATE_MOREDATA, got -1
msi.c:8674: Test failed: Expected USERINFOSTATE_PRESENT, got -1
msi.c:8677: Test failed: Expected "company", got "orange"
msi.c:8678: Test failed: Expected "ID", got "banana"
msi.c:8679: Test failed: Expected 5, got 0
msi.c:8680: Test failed: Expected 7, got 260
msi.c:8681: Test failed: Expected 2, got 260
msi.c:8734: Test failed: Expected MAX_PATH - 1, got 260
msi.c:8743: Test failed: Expected empty string, got "orange"
msi.c:8745: Test failed: Expected 0, got 260
msi.c:8746: Test failed: Expected MAX_PATH - 1, got 260
msi.c:8754: Test failed: Expected MAX_PATH - 1, got 260
msi.c:8764: Test failed: Expected "owner", got "apple"
msi.c:8765: Test failed: Expected empty string, got "orange"
msi.c:8767: Test failed: Expected 5, got 260
msi.c:8768: Test failed: Expected 0, got 260
msi.c:8769: Test failed: Expected MAX_PATH - 1, got 260
msi.c:8779: Test failed: Expected "owner", got "apple"
msi.c:8780: Test failed: Expected "company", got "orange"
msi.c:8782: Test failed: Expected 5, got 260
msi.c:8783: Test failed: Expected 7, got 260
msi.c:8784: Test failed: Expected MAX_PATH - 1, got 260
msi.c:8792: Test failed: Expected USERINFOSTATE_PRESENT, got 0
msi.c:8794: Test failed: Expected "owner", got "apple"
msi.c:8795: Test failed: Expected "company", got "orange"
msi.c:8796: Test failed: Expected "ID", got "banana"
msi.c:8797: Test failed: Expected 5, got 260
msi.c:8798: Test failed: Expected 7, got 260
msi.c:8799: Test failed: Expected 2, got 260
msi.c:8851: Test failed: Expected MAX_PATH - 1, got 260
msi.c:8860: Test failed: Expected empty string, got "orange"
msi.c:8862: Test failed: Expected 0, got 260
msi.c:8863: Test failed: Expected MAX_PATH - 1, got 260
msi.c:8871: Test failed: Expected MAX_PATH - 1, got 260
msi.c:8881: Test failed: Expected "owner", got "apple"
msi.c:8882: Test failed: Expected empty string, got "orange"
msi.c:8884: Test failed: Expected 5, got 260
msi.c:8885: Test failed: Expected 0, got 260
msi.c:8886: Test failed: Expected MAX_PATH - 1, got 260
msi.c:8896: Test failed: Expected "owner", got "apple"
msi.c:8897: Test failed: Expected "company", got "orange"
msi.c:8899: Test failed: Expected 5, got 260
msi.c:8900: Test failed: Expected 7, got 260
msi.c:8901: Test failed: Expected MAX_PATH - 1, got 260
msi.c:8909: Test failed: Expected USERINFOSTATE_PRESENT, got 0
msi.c:8911: Test failed: Expected "owner", got "apple"
msi.c:8912: Test failed: Expected "company", got "orange"
msi.c:8913: Test failed: Expected "ID", got "banana"
msi.c:8914: Test failed: Expected 5, got 260
msi.c:8915: Test failed: Expected 7, got 260
msi.c:8916: Test failed: Expected 2, got 260
msi.c:9073: Test failed: Expected ERROR_SUCCESS, got 1605
msi.c:9074: Test failed: Expected a valid product handle
msi.c:9078: Test failed: Expected ERROR_SUCCESS, got 6
msi.c:9079: Test failed: Expected "{A8B8351B-D65C-4A47-9E53-19881B419F00}", got "C:\Users\winetest\AppData\Local\Temp\\winetest.msi"
msi.c:9080: Test failed: Expected 38, got 260
msi.c:9142: Test failed: Expected ERROR_SUCCESS, got 1605
msi.c:9143: Test failed: Expected a valid product handle
msi.c:9147: Test failed: Expected ERROR_SUCCESS, got 6
msi.c:9148: Test failed: Expected "{A8B8351B-D65C-4A47-9E53-19881B419F00}", got "C:\Users\winetest\AppData\Local\Temp\\winetest.msi"
msi.c:9149: Test failed: Expected 38, got 260
msi.c:9209: Test failed: Expected ERROR_SUCCESS, got 1605
msi.c:9210: Test failed: Expected a valid product handle
msi.c:9214: Test failed: Expected ERROR_SUCCESS, got 6
msi.c:9215: Test failed: Expected "{A8B8351B-D65C-4A47-9E53-19881B419F00}", got "C:\Users\winetest\AppData\Local\Temp\\winetest.msi"
msi.c:9216: Test failed: Expected 38, got 260
msi.c:9366: Test failed: Expected ERROR_BAD_CONFIGURATION, got 259
msi.c:9391: Test failed: Expected ERROR_BAD_CONFIGURATION, got 259
msi.c:9442: Test failed: Expected ERROR_SUCCESS, got 259
msi.c:9443: Test failed: Expected "{DAFA4F21-73A2-4100-A4B1-01CBE1F1910B}", got "apple"
msi.c:9445: Test failed: Expected "{FDED8558-4415-4345-BD8C-ECDB0A0974C6}", got "banana"
msi.c:9447: Test failed: Expected MSIINSTALLCONTEXT_USERMANAGED, got -559038737
msi.c:9449: Test failed: Expected "S-1-5-21-3873039978-1556770456-971906989-1001", got "kiwi"
msi.c:9451: Test failed: Expected 45, got 260
msi.c:9463: Test failed: Expected ERROR_NO_MORE_ITEMS, got 87
msi.c:9503: Test failed: Expected ERROR_SUCCESS, got 259
msi.c:9504: Test failed: Expected "{FDED8558-4415-4345-BD8C-ECDB0A0974C6}", got "banana"
msi.c:9506: Test failed: Expected MSIINSTALLCONTEXT_USERMANAGED, got -559038737
msi.c:9508: Test failed: Expected "S-1-5-21-3873039978-1556770456-971906989-1001", got "kiwi"
msi.c:9510: Test failed: Expected 45, got 260
msi.c:9521: Test failed: Expected ERROR_SUCCESS, got 259
msi.c:9522: Test failed: Expected "{DAFA4F21-73A2-4100-A4B1-01CBE1F1910B}", got "apple"
msi.c:9524: Test failed: Expected MSIINSTALLCONTEXT_USERMANAGED, got -559038737
msi.c:9526: Test failed: Expected "S-1-5-21-3873039978-1556770456-971906989-1001", got "kiwi"
msi.c:9528: Test failed: Expected 45, got 260
msi.c:9539: Test failed: Expected ERROR_SUCCESS, got 259
msi.c:9540: Test failed: Expected "{DAFA4F21-73A2-4100-A4B1-01CBE1F1910B}", got "apple"
msi.c:9542: Test failed: Expected "{FDED8558-4415-4345-BD8C-ECDB0A0974C6}", got "banana"
msi.c:9544: Test failed: Expected "S-1-5-21-3873039978-1556770456-971906989-1001", got "kiwi"
msi.c:9546: Test failed: Expected 45, got 260
msi.c:9557: Test failed: Expected ERROR_SUCCESS, got 259
msi.c:9558: Test failed: Expected "{DAFA4F21-73A2-4100-A4B1-01CBE1F1910B}", got "apple"
msi.c:9560: Test failed: Expected "{FDED8558-4415-4345-BD8C-ECDB0A0974C6}", got "banana"
msi.c:9562: Test failed: Expected MSIINSTALLCONTEXT_USERMANAGED, got -559038737
msi.c:9564: Test failed: Expected 45*sizeof(WCHAR), got 260
msi.c:9576: Test failed: Expected ERROR_MORE_DATA, got 259
msi.c:9577: Test failed: Expected "{DAFA4F21-73A2-4100-A4B1-01CBE1F1910B}", got "apple"
msi.c:9579: Test failed: Expected "{FDED8558-4415-4345-BD8C-ECDB0A0974C6}", got "banana"
msi.c:9581: Test failed: Expected MSIINSTALLCONTEXT_USERMANAGED, got -559038737
msi.c:9583: Test failed: Expected "S-1-5-21-3873039978-1556770456-971906989-1001", got "kiwi"
msi.c:9585: Test failed: Expected 45*sizeof(WCHAR), got 45
msi.c:9597: Test failed: Expected ERROR_SUCCESS, got 259
msi.c:9598: Test failed: Expected "{DAFA4F21-73A2-4100-A4B1-01CBE1F1910B}", got "apple"
msi.c:9600: Test failed: Expected "{FDED8558-4415-4345-BD8C-ECDB0A0974C6}", got "banana"
msi.c:9602: Test failed: Expected MSIINSTALLCONTEXT_USERMANAGED, got -559038737
msi.c:9604: Test failed: Expected "S-1-5-21-3873039978-1556770456-971906989-1001", got "kiwi"
msi.c:9606: Test failed: Expected 45, got 46
msi.c:9616: Test failed: Expected ERROR_SUCCESS, got 259
msi.c:9617: Test failed: Expected "{DAFA4F21-73A2-4100-A4B1-01CBE1F1910B}", got "apple"
msi.c:9619: Test failed: Expected "{FDED8558-4415-4345-BD8C-ECDB0A0974C6}", got "banana"
msi.c:9621: Test failed: Expected MSIINSTALLCONTEXT_USERMANAGED, got -559038737
msi.c:9713: Test failed: Expected ERROR_BAD_CONFIGURATION, got 259
msi.c:9739: Test failed: Expected ERROR_SUCCESS, got 259
msi.c:9740: Test failed: Expected "{DAFA4F21-73A2-4100-A4B1-01CBE1F1910B}", got "apple"
msi.c:9742: Test failed: Expected "{FDED8558-4415-4345-BD8C-ECDB0A0974C6}", got "banana"
msi.c:9744: Test failed: Expected MSIINSTALLCONTEXT_USERMANAGED, got -559038737
msi.c:9746: Test failed: Expected "S-1-5-21-3873039978-1556770456-971906989-1001", got "kiwi"
msi.c:9748: Test failed: Expected 45, got 260
msi.c:9786: Test failed: Expected ERROR_SUCCESS, got 259
msi.c:9787: Test failed: Expected "{DAFA4F21-73A2-4100-A4B1-01CBE1F1910B}", got "apple"
msi.c:9789: Test failed: Expected "{FDED8558-4415-4345-BD8C-ECDB0A0974C6}", got "banana"
msi.c:9791: Test failed: Expected MSIINSTALLCONTEXT_USERMANAGED, got -559038737
msi.c:9793: Test failed: Expected "S-1-5-21-3873039978-1556770456-971906989-1001", got "kiwi"
msi.c:9795: Test failed: Expected 45, got 260
msi.c:9812: Test failed: Expected ERROR_SUCCESS, got 259
msi.c:9813: Test failed: Expected "{DAFA4F21-73A2-4100-A4B1-01CBE1F1910B}", got "apple"
msi.c:9815: Test failed: Expected "{FDED8558-4415-4345-BD8C-ECDB0A0974C6}", got "banana"
msi.c:9817: Test failed: Expected MSIINSTALLCONTEXT_USERMANAGED, got -559038737
msi.c:9819: Test failed: Expected "S-1-5-21-3873039978-1556770456-971906989-1001", got "kiwi"
msi.c:9821: Test failed: Expected 45, got 260
msi.c:9833: Test failed: Expected ERROR_NO_MORE_ITEMS, got 87
msi.c:9366: Test failed: Expected ERROR_BAD_CONFIGURATION, got 259
msi.c:9391: Test failed: Expected ERROR_BAD_CONFIGURATION, got 259
msi.c:9442: Test failed: Expected ERROR_SUCCESS, got 259
msi.c:9443: Test failed: Expected "{1A3DEB96-2A88-4E45-AE99-352A9BB7BD68}", got "apple"
msi.c:9445: Test failed: Expected "{43CA1F86-5E8F-47B4-A467-66ED080BE8EB}", got "banana"
msi.c:9447: Test failed: Expected MSIINSTALLCONTEXT_USERMANAGED, got -559038737
msi.c:9449: Test failed: Expected "S-1-5-21-3873039978-1556770456-971906989-1001", got "kiwi"
msi.c:9451: Test failed: Expected 45, got 260
msi.c:9463: Test failed: Expected ERROR_NO_MORE_ITEMS, got 87
msi.c:9503: Test failed: Expected ERROR_SUCCESS, got 259
msi.c:9504: Test failed: Expected "{43CA1F86-5E8F-47B4-A467-66ED080BE8EB}", got "banana"
msi.c:9506: Test failed: Expected MSIINSTALLCONTEXT_USERMANAGED, got -559038737
msi.c:9508: Test failed: Expected "S-1-5-21-3873039978-1556770456-971906989-1001", got "kiwi"
msi.c:9510: Test failed: Expected 45, got 260
msi.c:9521: Test failed: Expected ERROR_SUCCESS, got 259
msi.c:9522: Test failed: Expected "{1A3DEB96-2A88-4E45-AE99-352A9BB7BD68}", got "apple"
msi.c:9524: Test failed: Expected MSIINSTALLCONTEXT_USERMANAGED, got -559038737
msi.c:9526: Test failed: Expected "S-1-5-21-3873039978-1556770456-971906989-1001", got "kiwi"
msi.c:9528: Test failed: Expected 45, got 260
msi.c:9539: Test failed: Expected ERROR_SUCCESS, got 259
msi.c:9540: Test failed: Expected "{1A3DEB96-2A88-4E45-AE99-352A9BB7BD68}", got "apple"
msi.c:9542: Test failed: Expected "{43CA1F86-5E8F-47B4-A467-66ED080BE8EB}", got "banana"
msi.c:9544: Test failed: Expected "S-1-5-21-3873039978-1556770456-971906989-1001", got "kiwi"
msi.c:9546: Test failed: Expected 45, got 260
msi.c:9557: Test failed: Expected ERROR_SUCCESS, got 259
msi.c:9558: Test failed: Expected "{1A3DEB96-2A88-4E45-AE99-352A9BB7BD68}", got "apple"
msi.c:9560: Test failed: Expected "{43CA1F86-5E8F-47B4-A467-66ED080BE8EB}", got "banana"
msi.c:9562: Test failed: Expected MSIINSTALLCONTEXT_USERMANAGED, got -559038737
msi.c:9564: Test failed: Expected 45*sizeof(WCHAR), got 260
msi.c:9576: Test failed: Expected ERROR_MORE_DATA, got 259
msi.c:9577: Test failed: Expected "{1A3DEB96-2A88-4E45-AE99-352A9BB7BD68}", got "apple"
msi.c:9579: Test failed: Expected "{43CA1F86-5E8F-47B4-A467-66ED080BE8EB}", got "banana"
msi.c:9581: Test failed: Expected MSIINSTALLCONTEXT_USERMANAGED, got -559038737
msi.c:9583: Test failed: Expected "S-1-5-21-3873039978-1556770456-971906989-1001", got "kiwi"
msi.c:9585: Test failed: Expected 45*sizeof(WCHAR), got 45
msi.c:9597: Test failed: Expected ERROR_SUCCESS, got 259
msi.c:9598: Test failed: Expected "{1A3DEB96-2A88-4E45-AE99-352A9BB7BD68}", got "apple"
msi.c:9600: Test failed: Expected "{43CA1F86-5E8F-47B4-A467-66ED080BE8EB}", got "banana"
msi.c:9602: Test failed: Expected MSIINSTALLCONTEXT_USERMANAGED, got -559038737
msi.c:9604: Test failed: Expected "S-1-5-21-3873039978-1556770456-971906989-1001", got "kiwi"
msi.c:9606: Test failed: Expected 45, got 46
msi.c:9616: Test failed: Expected ERROR_SUCCESS, got 259
msi.c:9617: Test failed: Expected "{1A3DEB96-2A88-4E45-AE99-352A9BB7BD68}", got "apple"
msi.c:9619: Test failed: Expected "{43CA1F86-5E8F-47B4-A467-66ED080BE8EB}", got "banana"
msi.c:9621: Test failed: Expected MSIINSTALLCONTEXT_USERMANAGED, got -559038737
msi.c:9713: Test failed: Expected ERROR_BAD_CONFIGURATION, got 259
msi.c:9739: Test failed: Expected ERROR_SUCCESS, got 259
msi.c:9740: Test failed: Expected "{1A3DEB96-2A88-4E45-AE99-352A9BB7BD68}", got "apple"
msi.c:9742: Test failed: Expected "{43CA1F86-5E8F-47B4-A467-66ED080BE8EB}", got "banana"
msi.c:9744: Test failed: Expected MSIINSTALLCONTEXT_USERMANAGED, got -559038737
msi.c:9746: Test failed: Expected "S-1-5-21-3873039978-1556770456-971906989-1001", got "kiwi"
msi.c:9748: Test failed: Expected 45, got 260
msi.c:9786: Test failed: Expected ERROR_SUCCESS, got 259
msi.c:9787: Test failed: Expected "{1A3DEB96-2A88-4E45-AE99-352A9BB7BD68}", got "apple"
msi.c:9789: Test failed: Expected "{43CA1F86-5E8F-47B4-A467-66ED080BE8EB}", got "banana"
msi.c:9791: Test failed: Expected MSIINSTALLCONTEXT_USERMANAGED, got -559038737
msi.c:9793: Test failed: Expected "S-1-5-21-3873039978-1556770456-971906989-1001", got "kiwi"
msi.c:9795: Test failed: Expected 45, got 260
msi.c:9812: Test failed: Expected ERROR_SUCCESS, got 259
msi.c:9813: Test failed: Expected "{1A3DEB96-2A88-4E45-AE99-352A9BB7BD68}", got "apple"
msi.c:9815: Test failed: Expected "{43CA1F86-5E8F-47B4-A467-66ED080BE8EB}", got "banana"
msi.c:9817: Test failed: Expected MSIINSTALLCONTEXT_USERMANAGED, got -559038737
msi.c:9819: Test failed: Expected "S-1-5-21-3873039978-1556770456-971906989-1001", got "kiwi"
msi.c:9821: Test failed: Expected 45, got 260
msi.c:9833: Test failed: Expected ERROR_NO_MORE_ITEMS, got 87
msi.c:10075: Test failed: Expected ERROR_SUCCESS, got 259
msi.c:10076: Test failed: Expected "{77036B88-7128-41B8-B716-0605F74CC3F1}", got "apple"
msi.c:10078: Test failed: Expected "{519B457D-7E95-455D-BA9A-38E80A42E93E}", got "banana"
msi.c:10080: Test failed: Expected MSIINSTALLCONTEXT_USERUNMANAGED, got -559038737
msi.c:10082: Test failed: Expected "S-1-5-21-3873039978-1556770456-971906989-1001", got "kiwi"
msi.c:10084: Test failed: Expected 45, got 260
msi.c:10176: Test failed: Expected ERROR_BAD_CONFIGURATION, got 259
msi.c:10202: Test failed: Expected ERROR_SUCCESS, got 259
msi.c:10203: Test failed: Expected "{77036B88-7128-41B8-B716-0605F74CC3F1}", got "apple"
msi.c:10205: Test failed: Expected "{519B457D-7E95-455D-BA9A-38E80A42E93E}", got "banana"
msi.c:10207: Test failed: Expected MSIINSTALLCONTEXT_USERUNMANAGED, got -559038737
msi.c:10209: Test failed: Expected "S-1-5-21-3873039978-1556770456-971906989-1001", got "kiwi"
msi.c:10211: Test failed: Expected 45, got 260
msi.c:10249: Test failed: Expected ERROR_SUCCESS, got 259
msi.c:10250: Test failed: Expected "{77036B88-7128-41B8-B716-0605F74CC3F1}", got "apple"
msi.c:10252: Test failed: Expected "{519B457D-7E95-455D-BA9A-38E80A42E93E}", got "banana"
msi.c:10254: Test failed: Expected MSIINSTALLCONTEXT_USERUNMANAGED, got -559038737
msi.c:10256: Test failed: Expected "S-1-5-21-3873039978-1556770456-971906989-1001", got "kiwi"
msi.c:10258: Test failed: Expected 45, got 260
msi.c:10275: Test failed: Expected ERROR_SUCCESS, got 259
msi.c:10276: Test failed: Expected "{77036B88-7128-41B8-B716-0605F74CC3F1}", got "apple"
msi.c:10278: Test failed: Expected "{519B457D-7E95-455D-BA9A-38E80A42E93E}", got "banana"
msi.c:10280: Test failed: Expected MSIINSTALLCONTEXT_USERUNMANAGED, got -559038737
msi.c:10282: Test failed: Expected "S-1-5-21-3873039978-1556770456-971906989-1001", got "kiwi"
msi.c:10284: Test failed: Expected 45, got 260
msi.c:10296: Test failed: Expected ERROR_NO_MORE_ITEMS, got 87
msi.c:10075: Test failed: Expected ERROR_SUCCESS, got 259
msi.c:10076: Test failed: Expected "{446E6738-752F-4046-A996-208249BBC022}", got "apple"
msi.c:10078: Test failed: Expected "{601C5141-1D0A-4357-A02D-E1B3DEB31C6A}", got "banana"
msi.c:10080: Test failed: Expected MSIINSTALLCONTEXT_USERUNMANAGED, got -559038737
msi.c:10082: Test failed: Expected "S-1-5-21-3873039978-1556770456-971906989-1001", got "kiwi"
msi.c:10084: Test failed: Expected 45, got 260
msi.c:10176: Test failed: Expected ERROR_BAD_CONFIGURATION, got 259
msi.c:10202: Test failed: Expected ERROR_SUCCESS, got 259
msi.c:10203: Test failed: Expected "{446E6738-752F-4046-A996-208249BBC022}", got "apple"
msi.c:10205: Test failed: Expected "{601C5141-1D0A-4357-A02D-E1B3DEB31C6A}", got "banana"
msi.c:10207: Test failed: Expected MSIINSTALLCONTEXT_USERUNMANAGED, got -559038737
msi.c:10209: Test failed: Expected "S-1-5-21-3873039978-1556770456-971906989-1001", got "kiwi"
msi.c:10211: Test failed: Expected 45, got 260
msi.c:10249: Test failed: Expected ERROR_SUCCESS, got 259
msi.c:10250: Test failed: Expected "{446E6738-752F-4046-A996-208249BBC022}", got "apple"
msi.c:10252: Test failed: Expected "{601C5141-1D0A-4357-A02D-E1B3DEB31C6A}", got "banana"
msi.c:10254: Test failed: Expected MSIINSTALLCONTEXT_USERUNMANAGED, got -559038737
msi.c:10256: Test failed: Expected "S-1-5-21-3873039978-1556770456-971906989-1001", got "kiwi"
msi.c:10258: Test failed: Expected 45, got 260
msi.c:10275: Test failed: Expected ERROR_SUCCESS, got 259
msi.c:10276: Test failed: Expected "{446E6738-752F-4046-A996-208249BBC022}", got "apple"
msi.c:10278: Test failed: Expected "{601C5141-1D0A-4357-A02D-E1B3DEB31C6A}", got "banana"
msi.c:10280: Test failed: Expected MSIINSTALLCONTEXT_USERUNMANAGED, got -559038737
msi.c:10282: Test failed: Expected "S-1-5-21-3873039978-1556770456-971906989-1001", got "kiwi"
msi.c:10284: Test failed: Expected 45, got 260
msi.c:10296: Test failed: Expected ERROR_NO_MORE_ITEMS, got 87
msi.c:10588: Test failed: Expected ERROR_NO_MORE_ITEMS, got 0
msi.c:10589: Test failed: Expected patchcode to be unchanged, got {248D0341-E82C-4AE6-8B06-4DCB11BBF979}
msi.c:10591: Test failed: Expected targetprod to be unchanged, got {3A7B33AC-BD57-4B5D-BD3A-FF28040FE44F}
msi.c:10593: Test failed: Expected context to be unchanged, got 4
msi.c:10595: Test failed: Expected targetsid to be unchanged, got 
msi.c:10597: Test failed: Expected size to be unchanged, got 0
msi.c:10659: Test failed: Expected ERROR_SUCCESS, got 259
msi.c:10660: Test failed: Expected "{248D0341-E82C-4AE6-8B06-4DCB11BBF979}", got "apple"
msi.c:10662: Test failed: Expected "{3A7B33AC-BD57-4B5D-BD3A-FF28040FE44F}", got "banana"
msi.c:10664: Test failed: Expected MSIINSTALLCONTEXT_MACHINE, got -559038737
msi.c:10666: Test failed: Expected "", got "kiwi"
msi.c:10667: Test failed: Expected 0, got 260
msi.c:10704: Test failed: Expected ERROR_SUCCESS, got 259
msi.c:10705: Test failed: Expected "{248D0341-E82C-4AE6-8B06-4DCB11BBF979}", got "apple"
msi.c:10707: Test failed: Expected "{3A7B33AC-BD57-4B5D-BD3A-FF28040FE44F}", got "banana"
msi.c:10709: Test failed: Expected MSIINSTALLCONTEXT_MACHINE, got -559038737
msi.c:10711: Test failed: Expected "", got "kiwi"
msi.c:10712: Test failed: Expected 0, got 260
msi.c:11172: Test failed: Expected ERROR_NO_MORE_ITEMS, got 1605
msi.c:11187: Test failed: Expected ERROR_NO_MORE_ITEMS, got 1605
msi.c:11206: Test failed: Expected ERROR_BAD_CONFIGURATION, got 1605
msi.c:11224: Test failed: Expected ERROR_BAD_CONFIGURATION, got 1605
msi.c:11243: Test failed: Expected ERROR_NO_MORE_ITEMS, got 1605
msi.c:11262: Test failed: Expected ERROR_SUCCESS, got 1605
msi.c:11263: Test failed: Expected "{A1914F2B-FCF5-400F-BC06-AFA4E836152E}", got "apple"
msi.c:11265: Test failed: Expected "whatever", got "banana"
msi.c:11305: Test failed: Expected ERROR_MORE_DATA, got 1605
msi.c:11306: Test failed: Expected "{A1914F2B-FCF5-400F-BC06-AFA4E836152E}", got "apple"
msi.c:11311: Test failed: Expected 8 or 16, got 6
msi.c:11318: Test failed: Expected ERROR_NO_MORE_ITEMS, got 1605
msi.c:11330: Test failed: Expected ERROR_NO_MORE_ITEMS, got 1605
msi.c:11482: Test failed: Expected ERROR_SUCCESS, got 259
msi.c:11483: Test failed: Expected "{A1914F2B-FCF5-400F-BC06-AFA4E836152E}", got "apple"
msi.c:11485: Test failed: Expected "whatever", got "banana"
msi.c:11677: Test failed: Expected size to be unchanged, got 8
msi.c:12041: Test failed: Expected ERROR_UNKNOWN_PATCH, got 1605
msi.c:12055: Test failed: Expected ERROR_UNKNOWN_PATCHA, got 1605
msi.c:12069: Test failed: Expected ERROR_UNKNOWN_PATCH, got 1605
msi.c:12088: Test failed: Expected ERROR_UNKNOWN_PATCH, got 1605
msi.c:12102: Test failed: Expected ERROR_UNKNOWN_PATCH, got 1605
msi.c:12117: Test failed: Expected ERROR_UNKNOWN_PATCH, got 1605
msi.c:12136: Test failed: Expected ERROR_SUCCESS, got 1605
msi.c:12137: Test failed: Expected "", got "apple"
msi.c:12138: Test failed: Expected 0, got 260
msi.c:12150: Test failed: Expected ERROR_SUCCESS, got 1605
msi.c:12151: Test failed: Expected "pack", got "apple"
msi.c:12152: Test failed: Expected 4, got 260
msi.c:12159: Test failed: Expected ERROR_SUCCESS, got 1605
msi.c:12160: Test failed: Expected "transforms", got "apple"
msi.c:12161: Test failed: Expected 10, got 260
msi.c:12173: Test failed: Expected ERROR_SUCCESS, got 1605
msi.c:12174: Test failed: Expected "mydate", got "apple"
msi.c:12175: Test failed: Expected 6, got 260
msi.c:12187: Test failed: Expected ERROR_SUCCESS, got 1605
msi.c:12188: Test failed: Expected "yes", got "apple"
msi.c:12189: Test failed: Expected 3, got 260
msi.c:12201: Test failed: Expected ERROR_SUCCESS, got 1605
msi.c:12202: Test failed: Expected "good", got "apple"
msi.c:12203: Test failed: Expected 4, got 260
msi.c:12216: Test failed: Expected ERROR_SUCCESS, got 1605
msi.c:12217: Test failed: Expected "1", got "apple"
msi.c:12218: Test failed: Expected 1, got 260
msi.c:12231: Test failed: Expected ERROR_SUCCESS, got 1605
msi.c:12232: Test failed: Expected "1", got "apple"
msi.c:12233: Test failed: Expected 1, got 260
msi.c:12245: Test failed: Expected ERROR_SUCCESS, got 1605
msi.c:12246: Test failed: Expected "display", got "apple"
msi.c:12247: Test failed: Expected 7, got 260
msi.c:12259: Test failed: Expected ERROR_SUCCESS, got 1605
msi.c:12260: Test failed: Expected "moreinfo", got "apple"
msi.c:12261: Test failed: Expected 8, got 260
msi.c:12269: Test failed: Expected ERROR_UNKNOWN_PROPERTY, got 1605
msi.c:12279: Test failed: Expected ERROR_SUCCESS, got 1605
msi.c:12280: Test failed: Expected 16, got 260
msi.c:12295: Test failed: Expected ERROR_SUCCESS, got 1605
msi.c:12303: Test failed: Expected ERROR_MORE_DATA, got 1605
msi.c:12304: Test failed: Expected "moreinf", got "apple"
msi.c:12306: Test failed: Expected 16, got 8
msi.c:12314: Test failed: Expected ERROR_SUCCESS, got 1605
msi.c:12315: Test failed: Expected "moreinfo", got "apple"
msi.c:12317: Test failed: Expected 8, got 9
msi.c:12324: Test failed: Expected ERROR_SUCCESS, got 1605
msi.c:12325: Test failed: Expected 16, got 0
msi.c:12341: Test failed: Expected ERROR_SUCCESS, got 1605
msi.c:12342: Test failed: Expected "pack", got "apple"
msi.c:12343: Test failed: Expected 4, got 260
msi.c:12353: Test failed: Expected ERROR_UNKNOWN_PATCH, got 1605
msi.c:12416: Test failed: Expected ERROR_UNKNOWN_PATCH, got 1605
msi.c:12430: Test failed: Expected ERROR_UNKNOWN_PATCH, got 1605
msi.c:12444: Test failed: Expected ERROR_UNKNOWN_PATCH, got 1605
msi.c:12509: Test failed: Expected ERROR_SUCCESS, got 1647
msi.c:12510: Test failed: Expected "", got "apple"
msi.c:12511: Test failed: Expected 0, got 260
msi.c:12523: Test failed: Expected ERROR_SUCCESS, got 1647
msi.c:12524: Test failed: Expected "pack", got "apple"
msi.c:12525: Test failed: Expected 4, got 260
msi.c:12532: Test failed: Expected ERROR_SUCCESS, got 1647
msi.c:12533: Test failed: Expected "transforms", got "apple"
msi.c:12534: Test failed: Expected 10, got 260
msi.c:12550: Test failed: Expected ERROR_SUCCESS, got 1605
msi.c:12551: Test failed: Expected "pack", got "apple"
msi.c:12552: Test failed: Expected 4, got 260
msi.c:12562: Test failed: Expected ERROR_UNKNOWN_PATCH, got 1605
msi.c:12619: Test failed: Expected ERROR_UNKNOWN_PATCH, got 1605
msi.c:12633: Test failed: Expected ERROR_UNKNOWN_PATCH, got 1605
msi.c:12647: Test failed: Expected ERROR_UNKNOWN_PATCH, got 1605
msi.c:12711: Test failed: Expected ERROR_SUCCESS, got 1647
msi.c:12712: Test failed: Expected "", got "apple"
msi.c:12713: Test failed: Expected 0, got 260
msi.c:12725: Test failed: Expected ERROR_SUCCESS, got 1647
msi.c:12726: Test failed: Expected "pack", got "apple"
msi.c:12727: Test failed: Expected 4, got 260
msi.c:12752: Test failed: Expected ERROR_SUCCESS, got 1605
msi.c:12753: Test failed: Expected "pack", got "apple"
msi.c:12754: Test failed: Expected 4, got 260
msi.c:12764: Test failed: Expected ERROR_UNKNOWN_PATCH, got 1605
msi.c:12928: Test failed: expected ERROR_MORE_DATA got 1605
msi.c:12930: Test failed: expected 11 got 0
msi.c:12935: Test failed: expected ERROR_SUCCESS got 1605
msi.c:12936: Test failed: expected "c:\test.msp", got "apple"
msi.c:12937: Test failed: expected 11 got 260
msi.c:12942: Test failed: expected ERROR_MORE_DATA got 1605
msi.c:12944: Test failed: expected 11 got 0
msi.c:12949: Test failed: expected ERROR_SUCCESS got 1605
msi.c:12950: Test failed: expected > 0 got 0
msi.c:12951: Test failed: expected 11 got 260
msi.c:13045: Test failed: product1 not found
msi.c:13046: Test failed: product2 not found
msi.c:13319: Test failed: comp1 not found
msi.c:13320: Test failed: comp2 not found
msi.c:13411: Test failed: comp1 not found
msi.c:13412: Test failed: comp2 not found
package.c:8032: Test failed: Expected ERROR_SUCCESS, got 1605
package.c:8033: Test failed: Expected a valid product handle
package.c:8077: Test failed: Expected ERROR_SUCCESS, got 6
package.c:8078: Test failed: Expected "", got "apple"
package.c:8079: Test failed: Expected 0, got 260
package.c:8084: Test failed: Expected ERROR_SUCCESS, got 6
package.c:8085: Test failed: Expected "", got L"apple"
package.c:8086: Test failed: Expected 0, got 260
package.c:8092: Test failed: Expected ERROR_SUCCESS, got 6
package.c:8093: Test failed: Expected "{6F5B860B-D3D4-43C3-A3A8-C7F9CA0EDAE6}", got "apple"
package.c:8095: Test failed: Expected 38, got 260
package.c:8101: Test failed: Expected ERROR_SUCCESS, got 6
package.c:8102: Test failed: Expected L"{6F5B860B-D3D4-43C3-A3A8-C7F9CA0EDAE6}", got L"apple"
package.c:8104: Test failed: Expected 38, got 260
package.c:8110: Test failed: Expected ERROR_SUCCESS, got 6
package.c:8111: Test failed: Expected 38, got 260
package.c:8116: Test failed: Expected ERROR_SUCCESS, got 6
package.c:8117: Test failed: Expected 38, got 260
package.c:8127: Test failed: Expected 38, got 260
package.c:8136: Test failed: Expected 38, got 260
package.c:8143: Test failed: Expected ERROR_MORE_DATA, got 6
package.c:8144: Test failed: Expected first 3 chars of "{6F5B860B-D3D4-43C3-A3A8-C7F9CA0EDAE6}", got "apple"
package.c:8146: Test failed: Expected 38, got 4
package.c:8152: Test failed: Expected ERROR_MORE_DATA, got 6
package.c:8153: Test failed: Expected first 3 chars of L"{6F5B860B-D3D4-43C3-A3A8-C7F9CA0EDAE6}", got L"apple"
package.c:8155: Test failed: Expected 38, got 4
package.c:8162: Test failed: Expected ERROR_MORE_DATA, got 6
package.c:8163: Test failed: Expected first 37 chars of "{6F5B860B-D3D4-43C3-A3A8-C7F9CA0EDAE6}", got "apple"
package.c:8171: Test failed: Expected ERROR_MORE_DATA, got 6
package.c:8172: Test failed: Expected first 37 chars of L"{6F5B860B-D3D4-43C3-A3A8-C7F9CA0EDAE6}", got L"apple"
package.c:8181: Test failed: Expected ERROR_SUCCESS, got 6
package.c:8182: Test failed: Expected "{6F5B860B-D3D4-43C3-A3A8-C7F9CA0EDAE6}", got "apple"
package.c:8184: Test failed: Expected 38, got 39
package.c:8190: Test failed: Expected ERROR_SUCCESS, got 6
package.c:8191: Test failed: Expected L"{6F5B860B-D3D4-43C3-A3A8-C7F9CA0EDAE6}", got L"apple"
package.c:8193: Test failed: Expected 38, got 39
package.c:8200: Test failed: Expected ERROR_SUCCESS, got 6
package.c:8201: Test failed: Expected "", got "apple"
package.c:8202: Test failed: Expected 0, got 260
package.c:8207: Test failed: Expected ERROR_SUCCESS, got 6
package.c:8208: Test failed: Expected "", got L"apple"
package.c:8209: Test failed: Expected 0, got 260
package.c:8212: Test failed: Expected ERROR_SUCCESS, got 6
package.c:8218: Test failed: Expected ERROR_SUCCESS, got 6
package.c:8219: Test failed: Expected "", got "apple"
package.c:8220: Test failed: Expected 0, got 260
package.c:8225: Test failed: Expected ERROR_SUCCESS, got 6
package.c:8226: Test failed: Expected "", got L"apple"
package.c:8227: Test failed: Expected 0, got 260
package.c:8230: Test failed: Expected ERROR_SUCCESS, got 6
package.c:8236: Test failed: Expected ERROR_SUCCESS, got 6
package.c:8237: Test failed: Expected "{6F5B860B-D3D4-43C3-A3A8-C7F9CA0EDAE6}", got "apple"
package.c:8239: Test failed: Expected 38, got 260
package.c:8245: Test failed: Expected ERROR_SUCCESS, got 6
package.c:8246: Test failed: Expected L"{6F5B860B-D3D4-43C3-A3A8-C7F9CA0EDAE6}", got L"apple"
package.c:8248: Test failed: Expected 38, got 260
source.c:930: Test failed: Expected ERROR_BAD_CONFIGURATION, got 1605
source.c:940: Test failed: Expected ERROR_SUCCESS, got 1605
source.c:943: Test failed: Expected ERROR_SUCCESS, got 2
source.c:947: Test failed: Expected ERROR_SUCCESS, got 6
source.c:948: Test failed: Expected 'C:\source/', got nousersid\
source.c:949: Test failed: Expected 11, got 260
source.c:958: Test failed: Expected ERROR_SUCCESS, got 1605
source.c:961: Test failed: Expected ERROR_SUCCESS, got 2
source.c:965: Test failed: Expected ERROR_SUCCESS, got 6
source.c:966: Test failed: Expected 'C:\source/', got nousersid\
source.c:967: Test failed: Expected 11, got 260
source.c:971: Test failed: Expected ERROR_SUCCESS, got 6
source.c:972: Test failed: Expected 'another/', got nousersid\
source.c:973: Test failed: Expected 9, got 260
source.c:1021: Test failed: Expected ERROR_SUCCESS, got 1605
source.c:1024: Test failed: Expected ERROR_SUCCESS, got 2
source.c:1028: Test failed: Expected ERROR_SUCCESS, got 6
source.c:1029: Test failed: Expected 'C:\source/', got nousersid\
source.c:1030: Test failed: Expected 11, got 260
source.c:1413: Test failed: Expected ERROR_BAD_CONFIGURATION, got 1605
source.c:1426: Test failed: Expected ERROR_NO_MORE_ITEMS, got 1605
source.c:1439: Test failed: Expected ERROR_NO_MORE_ITEMS, got 1605
source.c:1452: Test failed: Expected ERROR_SUCCESS, got 1605
source.c:1453: Test failed: Expected "first", got aaa
source.c:1454: Test failed: Expected 5, got 260
source.c:1462: Test failed: Expected ERROR_SUCCESS, got 1605
source.c:1463: Test failed: Expected "first", got aaa
source.c:1464: Test failed: Expected 5, got 260
source.c:1476: Test failed: Expected ERROR_NO_MORE_ITEMS, got 1605
source.c:1489: Test failed: Expected ERROR_NO_MORE_ITEMS, got 1605
source.c:1502: Test failed: Expected ERROR_SUCCESS, got 1605
source.c:1503: Test failed: Expected "first", got aaa
source.c:1504: Test failed: Expected 5, got 260
source.c:2005: Test failed: Expected ERROR_BAD_CONFIGURATION, got 1605
source.c:2015: Test failed: Expected ERROR_SUCCESS, got 1605
source.c:2019: Test failed: Expected ERROR_SUCCESS, got 2
source.c:2020: Test failed: Key doesn't exist or wrong type
source.c:2063: Test failed: Expected ERROR_SUCCESS, got 1605
source.c:2067: Test failed: Expected ERROR_SUCCESS, got 2
source.c:2068: Test failed: Key doesn't exist or wrong type
source.c:2321: Test failed: Expected ERROR_BAD_CONFIGURATION, got 1605
source.c:2331: Test failed: Expected ERROR_SUCCESS, got 1605
source.c:2335: Test failed: Expected ERROR_SUCCESS, got 2
source.c:2337: Test failed: Key doesn't exist or wrong type
source.c:2380: Test failed: Expected ERROR_SUCCESS, got 1605
source.c:2384: Test failed: Expected ERROR_SUCCESS, got 2
source.c:2386: Test failed: Key doesn't exist or wrong type
source.c:3061: Test failed: Expected ERROR_BAD_CONFIGURATION, got 1605
source.c:3076: Test failed: Expected ERROR_NO_MORE_ITEMS, got 1605
source.c:3096: Test failed: Expected ERROR_NO_MORE_ITEMS, got 1605
source.c:3116: Test failed: Expected ERROR_SUCCESS, got 1605
source.c:3117: Test failed: Expected 2, got 0
source.c:3118: Test failed: Expected "label", got "aaa"
source.c:3119: Test failed: Expected 5, got 260
source.c:3120: Test failed: Expected "prompt", got "bbb"
source.c:3121: Test failed: Expected 6, got 260
source.c:3334: Test failed: Expected ERROR_BAD_CONFIGURATION, got 1605
source.c:3341: Test failed: Expected ERROR_SUCCESS, got 1605
source.c:3345: Test failed: Expected ERROR_SUCCESS, got 2
source.c:3351: Test failed: Key doesn't exist or wrong type
source.c:3362: Test failed: Expected ERROR_SUCCESS, got 1605
source.c:3366: Test failed: Expected ERROR_SUCCESS, got 2
source.c:3369: Test failed: Key doesn't exist or wrong type
source.c:3380: Test failed: Expected ERROR_SUCCESS, got 1605
source.c:3384: Test failed: Expected ERROR_SUCCESS, got 2
source.c:3387: Test failed: Key doesn't exist or wrong type
source.c:3391: Test failed: Expected ERROR_SUCCESS, got 1605
source.c:3394: Test failed: Key doesn't exist or wrong type
source.c:3395: Test failed: Key doesn't exist or wrong type
source.c:3402: Test failed: Expected ERROR_SUCCESS, got 1605
source.c:3405: Test failed: Key doesn't exist or wrong type
source.c:3406: Test failed: Key doesn't exist or wrong type
source.c:3407: Test failed: Key doesn't exist or wrong type
source.c:3486: Test failed: Expected ERROR_SUCCESS, got 1605
source.c:3495: Test failed: Expected ERROR_SUCCESS, got 2
source.c:3497: Test failed: Key doesn't exist or wrong type
source.c:3501: Test failed: Expected ERROR_SUCCESS, got 1605
source.c:3503: Test failed: Key doesn't exist or wrong type
source.c:3504: Test failed: Key doesn't exist or wrong type
sti:
sti.c:252: Test failed: could not unregister launch application, error 0x80070002
taskschd:
scheduler.c:344: Test failed: expected ERROR_DIR_NOT_EMPTY, got 0x80070005
scheduler.c:351: Test failed: DeleteFolder error 0x80070005
scheduler.c:354: Test failed: expected ERROR_FILE_NOT_FOUND, got 0x80070005
scheduler.c:474: Test failed: expected 2, got 3
scheduler.c:483: Test failed: expected 2, got 3
scheduler.c:515: Test failed: expected \Wine\Folder2, got L"\\Wine\\test"
scheduler.c:523: Test failed: expected Folder2, got L"test"
scheduler.c:538: Test failed: expected \Wine\Folder2, got L"\\Wine\\test"
scheduler.c:546: Test failed: expected Folder2, got L"test"
scheduler.c:554: Test failed: expected E_INVALIDARG, got 0
scheduler.c:580: Test failed: expected S_FALSE, got 0
scheduler.c:613: Test failed: expected S_FALSE, got 0
scheduler.c:614: Test failed: expected 0, got 1
scheduler.c:627: Test failed: expected S_FALSE, got 0
scheduler.c:628: Test failed: expected 2, got 3
scheduler.c:644: Test failed: expected \Wine\Folder2, got L"\\Wine\\test"
scheduler.c:652: Test failed: expected Folder2, got L"test"
scheduler.c:669: Test failed: DeleteFolder error 0x80070005
scheduler.c:771: Test failed: CreateFolder error 0x800700b7
scheduler.c:774: Test failed: expected ERROR_PATH_NOT_FOUND, got 0x80070005
0e3c:scheduler: unhandled exception c0000005 at 00405B9A
wscript.exe:
run: Timeout
Other errors
msi:msi prints too much data (57537 bytes)

w864

Windows 8.1+ 64 bit+IE11 / vm3Updated 2014/04/15; added Silverlight, optional DirectX components, msxml4 SP3, Visual C++ 2005 SP1 & 2010 SP1 runtimes. [CPU:core2duo*2cores RAM:1.5GB disk:virtio eth:e1000 snd:ich6 GPU:vga display:spice testagentd:1.6-detached]
d3dx9_36:
include1.h(1,2): error: "wrong include"
ddraw:
d3d.c:1994: Test failed: Unexpected destination texture level pixels; 2031 differences at 0 level
d3d.c:1994: Test failed: Unexpected destination texture level pixels; 518 differences at 1 level
d3d.c:1994: Test failed: Unexpected destination texture level pixels; 138 differences at 2 level
d3d.c:1994: Test failed: Unexpected destination texture level pixels; 46 differences at 3 level
d3d.c:2178: Test failed: Unexpected destination texture level pixels; 257 differences
d3d.c:2325: Test failed: Unexpected destination texture level pixels; 256 differences at 2 level
d3d.c:2325: Test failed: Unexpected destination texture level pixels; 64 differences at 3 level
d3d.c:2325: Test failed: Unexpected destination texture level pixels; 16 differences at 4 level
d3d.c:2325: Test failed: Unexpected destination texture level pixels; 4 differences at 5 level

w1064

Windows 10 64 bit / vm3Clean Windows 10 Home 64 bit installed on 2015/09/13. Added optional DirectX components. [CPU:core2duo*2cores RAM:3GB disk:virtio eth:e1000 snd:ich6 GPU:vga display:spice testagentd:1.6-detached]
d3d8:
device: Timeout
d3d9:
visual.c:8620: Test failed: Got unexpected color 0x00007580 for quad 2 (different colors).
d3dx9_36:
include1.h(1,2): error: "wrong include"
ddraw:
d3d.c:1994: Test failed: Unexpected destination texture level pixels; 2031 differences at 0 level
d3d.c:1994: Test failed: Unexpected destination texture level pixels; 518 differences at 1 level
d3d.c:1994: Test failed: Unexpected destination texture level pixels; 138 differences at 2 level
d3d.c:1994: Test failed: Unexpected destination texture level pixels; 46 differences at 3 level
d3d.c:2178: Test failed: Unexpected destination texture level pixels; 257 differences
d3d.c:2325: Test failed: Unexpected destination texture level pixels; 256 differences at 2 level
d3d.c:2325: Test failed: Unexpected destination texture level pixels; 64 differences at 3 level
d3d.c:2325: Test failed: Unexpected destination texture level pixels; 16 differences at 4 level
d3d.c:2325: Test failed: Unexpected destination texture level pixels; 4 differences at 5 level
psapi:
psapi_main.c:325: Test failed: expected approximately 20866 but got 20757
user32:
dde: Timeout
sysparams: Timeout
Other errors
kernel32:module crashed (c0000005)