Wine Test Bot
    

Job 38385 - WineTest: base VMs

Step no Task no Status VM Timeout File name Command line args Execution started Execution ended Number of test failures
1 1 completed wxppro 1800 winetest-latest.exe 13
1 2 completed w2003std 1800 winetest-latest.exe 145
1 3 completed wvistau64 1800 winetest-latest.exe 27
1 4 boterror wvistau64_zh_CN 1800 winetest-latest.exe
1 5 completed wvistau64_fr 1800 winetest-latest.exe 121
1 6 completed wvistau64_he 1800 winetest-latest.exe 15
1 7 completed w2008s64 1800 winetest-latest.exe 14
1 8 completed w7u 1800 winetest-latest.exe 11
1 9 completed w7pro64 1800 winetest-latest.exe 14
1 10 completed w8 1800 winetest-latest.exe 21
1 11 completed w864 1800 winetest-latest.exe 20
1 12 completed w1064 1800 winetest-latest.exe 24

wxppro

Windows XP Pro SP3 + IE8 / vm3Updated on 2014/04/17, added WinPcap, Silverlight, optional DirectX components, msxml4 SP3, Visual C++ 2005 SP1, 2008 SP1 and 2010 SP1 runtimes. [CPU:2*kvm32 RAM:1GB disk:virtio eth:rtl8139 snd:ac97 GPU:vga display:spice testagentd:1.6-detached]
hnetcfg:
policy.c:144: Test failed: got: L"C:\\Documents and Settings\\winetest\\Local Settings\\Temp\\wct\\hnetcfg_test.exe"
msi:
action.c:2509: Test failed: Expected 12, -12, 4, 10 or 24, got 80
action.c:2551: Test failed: Expected 12, -12, 4, 10 or 24, got 80
action.c:2620: Test failed: Expected 12, -12, 4, 10 or 24, got 80
action.c:2662: Test failed: Expected 12, -12, 4, 10 or 24, got 80
action.c:3529: Test failed: Expected 12, -12, 10 or 24, got 80
action.c:3635: Test failed: Expected 12, -12, 10 or 24, got 80
action.c:3718: Test failed: Expected 12, -12, 10 or 24, got 80
action.c:3778: Test failed: Expected 12, -12, 10 or 24, got 80
action.c:3838: Test failed: Expected 12, -20, 10 or 24, got 80
action.c:3921: Test failed: Expected 12, -12, 10 or 24, got 80
custom.c:552: Test failed: got 267

msi:install contains a misplaced failure message for custom

w2003std

Windows 2003 Std+IE8 / vm2Installed Internet Explorer 8, SP2 and all updates up to 2015/01/23. Added .Net 2.0 SP1, 3.0 SP2, 3.5 SP2 & 4, msxml4 SP3, Visual C++ 2005 SP1, 2008 SP1 & 2010 SP1 runtimes. [CPU:2*kvm32 RAM:1GB disk:virtio eth:e1000 snd:ac97 GPU:vga display:spice testagentd:1.6-iconized]
crypt32:
chain.c:4530: Test failed: ignoredInvalidDateBasePolicyCheck[0](#0001): expected 800b0101, got 800b0109
chain.c:4530: Test failed: googlePolicyCheckWithMatchingNameExpired[0](#0004): expected 800b0101, got 800b0109
chain.c:4530: Test failed: googlePolicyCheckWithMatchingName[0](#0004): expected 00000000, got 800b0109
chain.c:4530: Test failed: googlePolicyCheckWithMatchingName[0](#0004): expected 00000000, got 800b0109
chain.c:4530: Test failed: ignoredInvalidDateBasePolicyCheck[0](#0002): expected 800b0101, got 800b0109
hnetcfg:
policy.c:144: Test failed: got: L"C:\\Documents and Settings\\Administrator\\Local Settings\\Temp\\wct\\hnetcfg_test.exe"
msi:
action.c:2509: Test failed: Expected 12, -12, 4, 10 or 24, got 92
action.c:2551: Test failed: Expected 12, -12, 4, 10 or 24, got 92
action.c:2620: Test failed: Expected 12, -12, 4, 10 or 24, got 92
action.c:2662: Test failed: Expected 12, -12, 4, 10 or 24, got 92
action.c:3529: Test failed: Expected 12, -12, 10 or 24, got 92
action.c:3635: Test failed: Expected 12, -12, 10 or 24, got 92
action.c:3718: Test failed: Expected 12, -12, 10 or 24, got 92
action.c:3778: Test failed: Expected 12, -12, 10 or 24, got 92
action.c:3838: Test failed: Expected 12, -20, 10 or 24, got 92
action.c:3921: Test failed: Expected 12, -12, 10 or 24, got 92
urlmon:
protocol.c:250: Test failed: Expected ERROR_INTERNET_SEC_CERT_REV_FAILED got 12045
protocol.c:250: Test failed: Expected ERROR_INTERNET_SEC_CERT_REV_FAILED got 12045
protocol.c:250: Test failed: Expected ERROR_INTERNET_SEC_CERT_REV_FAILED got 12045
protocol.c:250: Test failed: Expected ERROR_INTERNET_SEC_CERT_REV_FAILED got 12045
protocol.c:250: Test failed: Expected ERROR_INTERNET_SEC_CERT_REV_FAILED got 12045
protocol.c:250: Test failed: Expected ERROR_INTERNET_SEC_CERT_REV_FAILED got 12045
protocol.c:250: Test failed: Expected ERROR_INTERNET_SEC_CERT_REV_FAILED got 12045
protocol.c:250: Test failed: Expected ERROR_INTERNET_SEC_CERT_REV_FAILED got 12045
protocol.c:250: Test failed: Expected ERROR_INTERNET_SEC_CERT_REV_FAILED got 12045
protocol.c:250: Test failed: Expected ERROR_INTERNET_SEC_CERT_REV_FAILED got 12045
protocol.c:250: Test failed: Expected ERROR_INTERNET_SEC_CERT_REV_FAILED got 12045
protocol.c:250: Test failed: Expected ERROR_INTERNET_SEC_CERT_REV_FAILED got 12045
protocol.c:250: Test failed: Expected ERROR_INTERNET_SEC_CERT_REV_FAILED got 12045
protocol.c:250: Test failed: Expected ERROR_INTERNET_SEC_CERT_REV_FAILED got 12045
protocol.c:250: Test failed: Expected ERROR_INTERNET_SEC_CERT_REV_FAILED got 12045
protocol.c:250: Test failed: Expected ERROR_INTERNET_SEC_CERT_REV_FAILED got 12045
protocol.c:250: Test failed: Expected ERROR_INTERNET_SEC_CERT_REV_FAILED got 12045
protocol.c:250: Test failed: Expected ERROR_INTERNET_SEC_CERT_REV_FAILED got 12045
protocol.c:250: Test failed: Expected ERROR_INTERNET_SEC_CERT_REV_FAILED got 12045
protocol.c:250: Test failed: Expected ERROR_INTERNET_SEC_CERT_REV_FAILED got 12045
protocol.c:250: Test failed: Expected ERROR_INTERNET_SEC_CERT_REV_FAILED got 12045
protocol.c:250: Test failed: Expected ERROR_INTERNET_SEC_CERT_REV_FAILED got 12045
protocol.c:250: Test failed: Expected ERROR_INTERNET_SEC_CERT_REV_FAILED got 12045
protocol.c:250: Test failed: Expected ERROR_INTERNET_SEC_CERT_REV_FAILED got 12045
protocol.c:250: Test failed: Expected ERROR_INTERNET_SEC_CERT_REV_FAILED got 12045
protocol.c:250: Test failed: Expected ERROR_INTERNET_SEC_CERT_REV_FAILED got 12045
protocol.c:250: Test failed: Expected ERROR_INTERNET_SEC_CERT_REV_FAILED got 12045
protocol.c:250: Test failed: Expected ERROR_INTERNET_SEC_CERT_REV_FAILED got 12045
protocol.c:250: Test failed: Expected ERROR_INTERNET_SEC_CERT_REV_FAILED got 12045
protocol.c:250: Test failed: Expected ERROR_INTERNET_SEC_CERT_REV_FAILED got 12045
protocol.c:250: Test failed: Expected ERROR_INTERNET_SEC_CERT_REV_FAILED got 12045
protocol.c:250: Test failed: Expected ERROR_INTERNET_SEC_CERT_REV_FAILED got 12045
protocol.c:250: Test failed: Expected ERROR_INTERNET_SEC_CERT_REV_FAILED got 12045
protocol.c:250: Test failed: Expected ERROR_INTERNET_SEC_CERT_REV_FAILED got 12045
protocol.c:250: Test failed: Expected ERROR_INTERNET_SEC_CERT_REV_FAILED got 12045
protocol.c:250: Test failed: Expected ERROR_INTERNET_SEC_CERT_REV_FAILED got 12045
protocol.c:250: Test failed: Expected ERROR_INTERNET_SEC_CERT_REV_FAILED got 12045
protocol.c:250: Test failed: Expected ERROR_INTERNET_SEC_CERT_REV_FAILED got 12045
protocol.c:250: Test failed: Expected ERROR_INTERNET_SEC_CERT_REV_FAILED got 12045
protocol.c:250: Test failed: Expected ERROR_INTERNET_SEC_CERT_REV_FAILED got 12045
protocol.c:250: Test failed: Expected ERROR_INTERNET_SEC_CERT_REV_FAILED got 12045
protocol.c:250: Test failed: Expected ERROR_INTERNET_SEC_CERT_REV_FAILED got 12045
protocol.c:250: Test failed: Expected ERROR_INTERNET_SEC_CERT_REV_FAILED got 12045
protocol.c:250: Test failed: Expected ERROR_INTERNET_SEC_CERT_REV_FAILED got 12045
protocol.c:250: Test failed: Expected ERROR_INTERNET_SEC_CERT_REV_FAILED got 12045
protocol.c:250: Test failed: Expected ERROR_INTERNET_SEC_CERT_REV_FAILED got 12045
protocol.c:250: Test failed: Expected ERROR_INTERNET_SEC_CERT_REV_FAILED got 12045
protocol.c:250: Test failed: Expected ERROR_INTERNET_SEC_CERT_REV_FAILED got 12045
protocol.c:250: Test failed: Expected ERROR_INTERNET_SEC_CERT_REV_FAILED got 12045
protocol.c:250: Test failed: Expected ERROR_INTERNET_SEC_CERT_REV_FAILED got 12045
protocol.c:250: Test failed: Expected ERROR_INTERNET_SEC_CERT_REV_FAILED got 12045
protocol.c:250: Test failed: Expected ERROR_INTERNET_SEC_CERT_REV_FAILED got 12045
protocol.c:250: Test failed: Expected ERROR_INTERNET_SEC_CERT_REV_FAILED got 12045
protocol.c:250: Test failed: Expected ERROR_INTERNET_SEC_CERT_REV_FAILED got 12045
protocol.c:250: Test failed: Expected ERROR_INTERNET_SEC_CERT_REV_FAILED got 12045
protocol.c:250: Test failed: Expected ERROR_INTERNET_SEC_CERT_REV_FAILED got 12045
protocol.c:250: Test failed: Expected ERROR_INTERNET_SEC_CERT_REV_FAILED got 12045
protocol.c:250: Test failed: Expected ERROR_INTERNET_SEC_CERT_REV_FAILED got 12045
protocol.c:250: Test failed: Expected ERROR_INTERNET_SEC_CERT_REV_FAILED got 12045
protocol.c:250: Test failed: Expected ERROR_INTERNET_SEC_CERT_REV_FAILED got 12045
protocol.c:250: Test failed: Expected ERROR_INTERNET_SEC_CERT_REV_FAILED got 12045
protocol.c:250: Test failed: Expected ERROR_INTERNET_SEC_CERT_REV_FAILED got 12045
protocol.c:250: Test failed: Expected ERROR_INTERNET_SEC_CERT_REV_FAILED got 12045
protocol.c:250: Test failed: Expected ERROR_INTERNET_SEC_CERT_REV_FAILED got 12045
protocol.c:250: Test failed: Expected ERROR_INTERNET_SEC_CERT_REV_FAILED got 12045
protocol.c:250: Test failed: Expected ERROR_INTERNET_SEC_CERT_REV_FAILED got 12045
protocol.c:250: Test failed: Expected ERROR_INTERNET_SEC_CERT_REV_FAILED got 12045
protocol.c:250: Test failed: Expected ERROR_INTERNET_SEC_CERT_REV_FAILED got 12045
protocol.c:250: Test failed: Expected ERROR_INTERNET_SEC_CERT_REV_FAILED got 12045
protocol.c:250: Test failed: Expected ERROR_INTERNET_SEC_CERT_REV_FAILED got 12045
protocol.c:250: Test failed: Expected ERROR_INTERNET_SEC_CERT_REV_FAILED got 12045
protocol.c:250: Test failed: Expected ERROR_INTERNET_SEC_CERT_REV_FAILED got 12045
protocol.c:250: Test failed: Expected ERROR_INTERNET_SEC_CERT_REV_FAILED got 12045
protocol.c:250: Test failed: Expected ERROR_INTERNET_SEC_CERT_REV_FAILED got 12045
protocol.c:250: Test failed: Expected ERROR_INTERNET_SEC_CERT_REV_FAILED got 12045
protocol.c:250: Test failed: Expected ERROR_INTERNET_SEC_CERT_REV_FAILED got 12045
protocol.c:250: Test failed: Expected ERROR_INTERNET_SEC_CERT_REV_FAILED got 12045
protocol.c:250: Test failed: Expected ERROR_INTERNET_SEC_CERT_REV_FAILED got 12045
protocol.c:250: Test failed: Expected ERROR_INTERNET_SEC_CERT_REV_FAILED got 12045
protocol.c:250: Test failed: Expected ERROR_INTERNET_SEC_CERT_REV_FAILED got 12045
protocol.c:250: Test failed: Expected ERROR_INTERNET_SEC_CERT_REV_FAILED got 12045
protocol.c:250: Test failed: Expected ERROR_INTERNET_SEC_CERT_REV_FAILED got 12045
protocol.c:250: Test failed: Expected ERROR_INTERNET_SEC_CERT_REV_FAILED got 12045
protocol.c:250: Test failed: Expected ERROR_INTERNET_SEC_CERT_REV_FAILED got 12045
protocol.c:250: Test failed: Expected ERROR_INTERNET_SEC_CERT_REV_FAILED got 12045
protocol.c:250: Test failed: Expected ERROR_INTERNET_SEC_CERT_REV_FAILED got 12045
protocol.c:250: Test failed: Expected ERROR_INTERNET_SEC_CERT_REV_FAILED got 12045
protocol.c:250: Test failed: Expected ERROR_INTERNET_SEC_CERT_REV_FAILED got 12045
protocol.c:250: Test failed: Expected ERROR_INTERNET_SEC_CERT_REV_FAILED got 12045
protocol.c:250: Test failed: Expected ERROR_INTERNET_SEC_CERT_REV_FAILED got 12045
protocol.c:250: Test failed: Expected ERROR_INTERNET_SEC_CERT_REV_FAILED got 12045
protocol.c:250: Test failed: Expected ERROR_INTERNET_SEC_CERT_REV_FAILED got 12045
protocol.c:250: Test failed: Expected ERROR_INTERNET_SEC_CERT_REV_FAILED got 12045
protocol.c:250: Test failed: Expected ERROR_INTERNET_SEC_CERT_REV_FAILED got 12045
protocol.c:250: Test failed: Expected ERROR_INTERNET_SEC_CERT_REV_FAILED got 12045
protocol.c:250: Test failed: Expected ERROR_INTERNET_SEC_CERT_REV_FAILED got 12045
protocol.c:250: Test failed: Expected ERROR_INTERNET_SEC_CERT_REV_FAILED got 12045
protocol.c:250: Test failed: Expected ERROR_INTERNET_SEC_CERT_REV_FAILED got 12045
protocol.c:250: Test failed: Expected ERROR_INTERNET_SEC_CERT_REV_FAILED got 12045
protocol.c:250: Test failed: Expected ERROR_INTERNET_SEC_CERT_REV_FAILED got 12045
protocol.c:250: Test failed: Expected ERROR_INTERNET_SEC_CERT_REV_FAILED got 12045
protocol.c:250: Test failed: Expected ERROR_INTERNET_SEC_CERT_REV_FAILED got 12045
protocol.c:250: Test failed: Expected ERROR_INTERNET_SEC_CERT_REV_FAILED got 12045
protocol.c:250: Test failed: Expected ERROR_INTERNET_SEC_CERT_REV_FAILED got 12045
protocol.c:250: Test failed: Expected ERROR_INTERNET_SEC_CERT_REV_FAILED got 12045
protocol.c:250: Test failed: Expected ERROR_INTERNET_SEC_CERT_REV_FAILED got 12045
protocol.c:250: Test failed: Expected ERROR_INTERNET_SEC_CERT_REV_FAILED got 12045
protocol.c:250: Test failed: Expected ERROR_INTERNET_SEC_CERT_REV_FAILED got 12045
protocol.c:250: Test failed: Expected ERROR_INTERNET_SEC_CERT_REV_FAILED got 12045
protocol.c:250: Test failed: Expected ERROR_INTERNET_SEC_CERT_REV_FAILED got 12045
protocol.c:250: Test failed: Expected ERROR_INTERNET_SEC_CERT_REV_FAILED got 12045
protocol.c:250: Test failed: Expected ERROR_INTERNET_SEC_CERT_REV_FAILED got 12045
protocol.c:250: Test failed: Expected ERROR_INTERNET_SEC_CERT_REV_FAILED got 12045
protocol.c:250: Test failed: Expected ERROR_INTERNET_SEC_CERT_REV_FAILED got 12045
protocol.c:250: Test failed: Expected ERROR_INTERNET_SEC_CERT_REV_FAILED got 12045
protocol.c:250: Test failed: Expected ERROR_INTERNET_SEC_CERT_REV_FAILED got 12045
protocol.c:250: Test failed: Expected ERROR_INTERNET_SEC_CERT_REV_FAILED got 12045
protocol.c:250: Test failed: Expected ERROR_INTERNET_SEC_CERT_REV_FAILED got 12045
protocol.c:250: Test failed: Expected ERROR_INTERNET_SEC_CERT_REV_FAILED got 12045
protocol.c:250: Test failed: Expected ERROR_INTERNET_SEC_CERT_REV_FAILED got 12045
protocol.c:250: Test failed: Expected ERROR_INTERNET_SEC_CERT_REV_FAILED got 12045
protocol.c:250: Test failed: Expected ERROR_INTERNET_SEC_CERT_REV_FAILED got 12045
protocol.c:250: Test failed: Expected ERROR_INTERNET_SEC_CERT_REV_FAILED got 12045
protocol.c:250: Test failed: Expected ERROR_INTERNET_SEC_CERT_REV_FAILED got 12045
protocol.c:250: Test failed: Expected ERROR_INTERNET_SEC_CERT_REV_FAILED got 12045
user32:
msg.c:14539: Test failed: single menu item command: 2: in msg 0x0007 expecting lParam 0x20000001 got 0x60000001
msg.c:14539: Test failed: single menu item command: 3: in msg 0x0104 expecting lParam 0x20000001 got 0x60000001
msg.c:14539: Test failed: single menu item command: 4: in msg 0x0106 expecting lParam 0x20000001 got 0x60000001
wmp:
0840:oleobj: unhandled exception c0000005 at 4F9456CB

wvistau64

Vista Ultimate 64 bit English+IE8 / vm2Updated on 2014/04/21. Running tests from E: drive. Added WinPcap, Silverlight, optional DirectX components, msxml4 SP3, Visual C++ 2005/2008/2010 SP1, 2012/2013/2015 runtimes. [CPU:2*kvm64 RAM:1GB disks:2*virtio eth:e1000 snd:none GPU:vga display:VNC testagentd:1.6-detached]
msi:
action.c:2509: Test failed: Expected 12, -12, 4, 10 or 24, got 80
action.c:2551: Test failed: Expected 12, -12, 4, 10 or 24, got 80
action.c:2620: Test failed: Expected 12, -12, 4, 10 or 24, got 80
action.c:2662: Test failed: Expected 12, -12, 4, 10 or 24, got 80
action.c:3529: Test failed: Expected 12, -12, 10 or 24, got 80
action.c:3635: Test failed: Expected 12, -12, 10 or 24, got 80
action.c:3718: Test failed: Expected 12, -12, 10 or 24, got 80
action.c:3778: Test failed: Expected 12, -12, 10 or 24, got 80
action.c:3838: Test failed: Expected 12, -20, 10 or 24, got 80
action.c:3921: Test failed: Expected 12, -12, 10 or 24, got 80
user32:
win.c:9834: Test failed: GetActiveWindow() = 012E0328
win.c:9834: Test failed: GetFocus() = 00000000
win.c:9836: Test failed: expected 012E0328, got 00970356
win.c:9839: Test failed: GetActiveWindow() = 012E0328
win.c:9839: Test failed: GetFocus() = 00000000
win.c:9840: Test failed: expected 012E0328, got 00970356
win.c:9862: Test failed: GetActiveWindow() = 012E0328
win.c:9862: Test failed: GetFocus() = 00000000
win.c:9864: Test failed: expected 012E0328, got 000500F8
win.c:9865: Test failed: expected 000500F8, got 00030180
win.c:9878: Test failed: GetActiveWindow() = 012E0328
win.c:9878: Test failed: GetFocus() = 00000000
win.c:9885: Test failed: GetFocus() = 00000000
win.c:9896: Test failed: GetActiveWindow() = 00050180
win.c:9896: Test failed: GetFocus() = 00000000
win.c:9907: Test failed: GetFocus() = 00000000
ws2_32:
0648:sock: unhandled exception c0000005 at 7634335C

wvistau64_zh_CN

Vista Ultimate 64 bit Chinese+IE8 / vm2Updated on 2014/04/21. Running tests from E: drive. Added WinPcap, Silverlight, optional DirectX components, msxml4 SP3, Visual C++ 2005/2008/2010 SP1, 2012/2013/2015 runtimes. [CPU:2*kvm64 RAM:1GB disks:2*virtio eth:e1000 snd:none GPU:vga display:VNC testagentd:1.6-detached]
An error occurred while retrieving the test report: unable to open 'wvistau64_zh_CN.rpt' for reading: No such file or directory
The test VM has crashed, rebooted or lost connectivity (or the TestAgent server died)
Giving up after 3 run(s)

wvistau64_fr

Vista Ultimate 64 bit French+IE8 / vm2Updated on 2014/04/21. Running tests from E: drive. Added WinPcap, Silverlight, optional DirectX components, msxml4 SP3, Visual C++ 2005/2008/2010 SP1, 2012/2013/2015 runtimes. [CPU:2*kvm64 RAM:1GB disks:2*virtio eth:e1000 snd:none GPU:vga display:VNC testagentd:1.6-detached]
gdi32:
font.c:5535: Test failed: Arial: style names don't match: returned Regular, expect Normal
font.c:5535: Test failed: Arial: style names don't match: returned Regular, expect Normal
font.c:5535: Test failed: Arial: style names don't match: returned Regular, expect Normal
font.c:5535: Test failed: Arial: style names don't match: returned Regular, expect Normal
font.c:5535: Test failed: Arial: style names don't match: returned Regular, expect Normal
font.c:5535: Test failed: Arial: style names don't match: returned Regular, expect Normal
font.c:5535: Test failed: Arial: style names don't match: returned Regular, expect Normal
font.c:5535: Test failed: Arial: style names don't match: returned Regular, expect Normal
font.c:5535: Test failed: Arial: style names don't match: returned Regular, expect Normal
font.c:5525: Test failed: Arial: font face names don't match: returned Arial Italic, expect Arial Italique
font.c:5535: Test failed: Arial: style names don't match: returned Italic, expect Italique
font.c:5525: Test failed: Arial: font face names don't match: returned Arial Italic, expect Arial Italique
font.c:5535: Test failed: Arial: style names don't match: returned Italic, expect Italique
font.c:5525: Test failed: Arial: font face names don't match: returned Arial Italic, expect Arial Italique
font.c:5535: Test failed: Arial: style names don't match: returned Italic, expect Italique
font.c:5525: Test failed: Arial: font face names don't match: returned Arial Italic, expect Arial Italique
font.c:5535: Test failed: Arial: style names don't match: returned Italic, expect Italique
font.c:5525: Test failed: Arial: font face names don't match: returned Arial Italic, expect Arial Italique
font.c:5535: Test failed: Arial: style names don't match: returned Italic, expect Italique
font.c:5525: Test failed: Arial: font face names don't match: returned Arial Italic, expect Arial Italique
font.c:5535: Test failed: Arial: style names don't match: returned Italic, expect Italique
font.c:5525: Test failed: Arial: font face names don't match: returned Arial Italic, expect Arial Italique
font.c:5535: Test failed: Arial: style names don't match: returned Italic, expect Italique
font.c:5525: Test failed: Arial: font face names don't match: returned Arial Italic, expect Arial Italique
font.c:5535: Test failed: Arial: style names don't match: returned Italic, expect Italique
font.c:5525: Test failed: Arial: font face names don't match: returned Arial Bold, expect Arial Gras
font.c:5535: Test failed: Arial: style names don't match: returned Bold, expect Gras
font.c:5525: Test failed: Arial: font face names don't match: returned Arial Bold, expect Arial Gras
font.c:5535: Test failed: Arial: style names don't match: returned Bold, expect Gras
font.c:5525: Test failed: Arial: font face names don't match: returned Arial Bold, expect Arial Gras
font.c:5535: Test failed: Arial: style names don't match: returned Bold, expect Gras
font.c:5525: Test failed: Arial: font face names don't match: returned Arial Bold, expect Arial Gras
font.c:5535: Test failed: Arial: style names don't match: returned Bold, expect Gras
font.c:5525: Test failed: Arial: font face names don't match: returned Arial Bold, expect Arial Gras
font.c:5535: Test failed: Arial: style names don't match: returned Bold, expect Gras
font.c:5525: Test failed: Arial: font face names don't match: returned Arial Bold, expect Arial Gras
font.c:5535: Test failed: Arial: style names don't match: returned Bold, expect Gras
font.c:5525: Test failed: Arial: font face names don't match: returned Arial Bold, expect Arial Gras
font.c:5535: Test failed: Arial: style names don't match: returned Bold, expect Gras
font.c:5525: Test failed: Arial: font face names don't match: returned Arial Bold, expect Arial Gras
font.c:5535: Test failed: Arial: style names don't match: returned Bold, expect Gras
font.c:5525: Test failed: Arial: font face names don't match: returned Arial Bold, expect Arial Gras
font.c:5535: Test failed: Arial: style names don't match: returned Bold, expect Gras
font.c:5525: Test failed: Arial: font face names don't match: returned Arial Bold Italic, expect Arial Gras Italique
font.c:5535: Test failed: Arial: style names don't match: returned Bold Italic, expect Gras Italique
font.c:5525: Test failed: Arial: font face names don't match: returned Arial Bold Italic, expect Arial Gras Italique
font.c:5535: Test failed: Arial: style names don't match: returned Bold Italic, expect Gras Italique
font.c:5525: Test failed: Arial: font face names don't match: returned Arial Bold Italic, expect Arial Gras Italique
font.c:5535: Test failed: Arial: style names don't match: returned Bold Italic, expect Gras Italique
font.c:5525: Test failed: Arial: font face names don't match: returned Arial Bold Italic, expect Arial Gras Italique
font.c:5535: Test failed: Arial: style names don't match: returned Bold Italic, expect Gras Italique
font.c:5525: Test failed: Arial: font face names don't match: returned Arial Bold Italic, expect Arial Gras Italique
font.c:5535: Test failed: Arial: style names don't match: returned Bold Italic, expect Gras Italique
font.c:5525: Test failed: Arial: font face names don't match: returned Arial Bold Italic, expect Arial Gras Italique
font.c:5535: Test failed: Arial: style names don't match: returned Bold Italic, expect Gras Italique
font.c:5525: Test failed: Arial: font face names don't match: returned Arial Bold Italic, expect Arial Gras Italique
font.c:5535: Test failed: Arial: style names don't match: returned Bold Italic, expect Gras Italique
font.c:5525: Test failed: Arial: font face names don't match: returned Arial Bold Italic, expect Arial Gras Italique
font.c:5535: Test failed: Arial: style names don't match: returned Bold Italic, expect Gras Italique
font.c:5535: Test failed: Tahoma: style names don't match: returned Regular, expect Normal
font.c:5535: Test failed: Tahoma: style names don't match: returned Regular, expect Normal
font.c:5535: Test failed: Tahoma: style names don't match: returned Regular, expect Normal
font.c:5535: Test failed: Tahoma: style names don't match: returned Regular, expect Normal
font.c:5535: Test failed: Tahoma: style names don't match: returned Regular, expect Normal
font.c:5535: Test failed: Tahoma: style names don't match: returned Regular, expect Normal
font.c:5535: Test failed: Tahoma: style names don't match: returned Regular, expect Normal
font.c:5535: Test failed: Tahoma: style names don't match: returned Regular, expect Normal
font.c:5535: Test failed: Tahoma: style names don't match: returned Regular, expect Normal
font.c:5535: Test failed: Tahoma: style names don't match: returned Regular, expect Normal
font.c:5525: Test failed: Tahoma: font face names don't match: returned Tahoma Bold, expect Tahoma Gras
font.c:5535: Test failed: Tahoma: style names don't match: returned Bold, expect Gras
font.c:5525: Test failed: Tahoma: font face names don't match: returned Tahoma Bold, expect Tahoma Gras
font.c:5535: Test failed: Tahoma: style names don't match: returned Bold, expect Gras
font.c:5525: Test failed: Tahoma: font face names don't match: returned Tahoma Bold, expect Tahoma Gras
font.c:5535: Test failed: Tahoma: style names don't match: returned Bold, expect Gras
font.c:5525: Test failed: Tahoma: font face names don't match: returned Tahoma Bold, expect Tahoma Gras
font.c:5535: Test failed: Tahoma: style names don't match: returned Bold, expect Gras
font.c:5525: Test failed: Tahoma: font face names don't match: returned Tahoma Bold, expect Tahoma Gras
font.c:5535: Test failed: Tahoma: style names don't match: returned Bold, expect Gras
font.c:5525: Test failed: Tahoma: font face names don't match: returned Tahoma Bold, expect Tahoma Gras
font.c:5535: Test failed: Tahoma: style names don't match: returned Bold, expect Gras
font.c:5525: Test failed: Tahoma: font face names don't match: returned Tahoma Bold, expect Tahoma Gras
font.c:5535: Test failed: Tahoma: style names don't match: returned Bold, expect Gras
font.c:5525: Test failed: Tahoma: font face names don't match: returned Tahoma Bold, expect Tahoma Gras
font.c:5535: Test failed: Tahoma: style names don't match: returned Bold, expect Gras
font.c:5525: Test failed: Tahoma: font face names don't match: returned Tahoma Bold, expect Tahoma Gras
font.c:5535: Test failed: Tahoma: style names don't match: returned Bold, expect Gras
font.c:5525: Test failed: Tahoma: font face names don't match: returned Tahoma Bold, expect Tahoma Gras
font.c:5535: Test failed: Tahoma: style names don't match: returned Bold, expect Gras
font.c:5535: Test failed: Webdings: style names don't match: returned Regular, expect Normal
font.c:5535: Test failed: Wingdings: style names don't match: returned Regular, expect Normal
msi:
action.c:2509: Test failed: Expected 12, -12, 4, 10 or 24, got 80
action.c:2551: Test failed: Expected 12, -12, 4, 10 or 24, got 80
action.c:2620: Test failed: Expected 12, -12, 4, 10 or 24, got 80
action.c:2662: Test failed: Expected 12, -12, 4, 10 or 24, got 80
action.c:3529: Test failed: Expected 12, -12, 10 or 24, got 80
action.c:3635: Test failed: Expected 12, -12, 10 or 24, got 80
action.c:3718: Test failed: Expected 12, -12, 10 or 24, got 80
action.c:3778: Test failed: Expected 12, -12, 10 or 24, got 80
action.c:3838: Test failed: Expected 12, -20, 10 or 24, got 80
action.c:3921: Test failed: Expected 12, -12, 10 or 24, got 80
user32:
win.c:9834: Test failed: GetActiveWindow() = 0006215A
win.c:9834: Test failed: GetFocus() = 00000000
win.c:9836: Test failed: expected 0006215A, got 00D6035C
win.c:9839: Test failed: GetActiveWindow() = 0006215A
win.c:9839: Test failed: GetFocus() = 00000000
win.c:9840: Test failed: expected 0006215A, got 00D6035C
win.c:9862: Test failed: GetActiveWindow() = 0006215A
win.c:9862: Test failed: GetFocus() = 00000000
win.c:9864: Test failed: expected 0006215A, got 0005009A
win.c:9865: Test failed: expected 0005009A, got 00071EDA
win.c:9878: Test failed: GetActiveWindow() = 0006215A
win.c:9878: Test failed: GetFocus() = 00000000
win.c:9885: Test failed: GetFocus() = 00000000
win.c:9896: Test failed: GetActiveWindow() = 00081EDA
win.c:9896: Test failed: GetFocus() = 00000000
win.c:9907: Test failed: GetFocus() = 00000000
wmp:
media.c:147: Test failed: unexpected event for  OPENSTATE, index:6
media.c:147: Test failed: unexpected event for  OPENSTATE, index:8
media.c:147: Test failed: unexpected event for  OPENSTATE, index:6
media.c:152: Test failed: unexpected event for  PLAYSTATE, index:10

wvistau64_he

Vista Ultimate 64 bit Hebrew+IE8 / vm2Updated on 2014/04/21. Running tests from E: drive. Added WinPcap, Silverlight, optional DirectX components, msxml4 SP3, Visual C++ 2005/2008/2010 SP1, 2012/2013/2015 runtimes. [CPU:2*kvm64 RAM:1GB disks:2*virtio eth:e1000 snd:none GPU:vga display:VNC testagentd:1.6-iconized]
msi:
action.c:2509: Test failed: Expected 12, -12, 4, 10 or 24, got 80
action.c:2551: Test failed: Expected 12, -12, 4, 10 or 24, got 80
action.c:2620: Test failed: Expected 12, -12, 4, 10 or 24, got 80
action.c:2662: Test failed: Expected 12, -12, 4, 10 or 24, got 80
action.c:3529: Test failed: Expected 12, -12, 10 or 24, got 80
action.c:3635: Test failed: Expected 12, -12, 10 or 24, got 80
action.c:3718: Test failed: Expected 12, -12, 10 or 24, got 80
action.c:3778: Test failed: Expected 12, -12, 10 or 24, got 80
action.c:3838: Test failed: Expected 12, -20, 10 or 24, got 80
action.c:3921: Test failed: Expected 12, -12, 10 or 24, got 80
riched20:
editor.c:6574: Test failed: wrong event mask (0x0) during WM_COMMAND
wmp:
media.c:147: Test failed: unexpected event for  OPENSTATE, index:6
media.c:147: Test failed: unexpected event for  OPENSTATE, index:8
media.c:147: Test failed: unexpected event for  OPENSTATE, index:6
media.c:152: Test failed: unexpected event for  PLAYSTATE, index:10

w2008s64

Win Server 2008 Std 64-bit PU+IE9 / vm2Upgraded with Internet Explorer 9, .Net Framework 3.5 SP1 & 4.5.1 and all updates up to 2013/04/15. Added Visual C++ 2012 & 2013 runtimes. [CPU:2*kvm64 RAM:1GB disk:virtio eth:2*e1000 snd:none GPU:vga display:VNC testagentd:1.5-iconized]
hnetcfg:
policy.c:144: Test failed: got: L"C:\\Users\\Administrator\\AppData\\Local\\Temp\\wct\\hnetcfg_test.exe"
msi:
action.c:2509: Test failed: Expected 12, -12, 4, 10 or 24, got 80
action.c:2551: Test failed: Expected 12, -12, 4, 10 or 24, got 80
action.c:2620: Test failed: Expected 12, -12, 4, 10 or 24, got 80
action.c:2662: Test failed: Expected 12, -12, 4, 10 or 24, got 80
action.c:3529: Test failed: Expected 12, -12, 10 or 24, got 80
action.c:3635: Test failed: Expected 12, -12, 10 or 24, got 80
action.c:3718: Test failed: Expected 12, -12, 10 or 24, got 80
action.c:3778: Test failed: Expected 12, -12, 10 or 24, got 80
action.c:3838: Test failed: Expected 12, -20, 10 or 24, got 80
action.c:3921: Test failed: Expected 12, -12, 10 or 24, got 80
user32:
msg.c:14539: Test failed: single menu item command: 2: in msg 0x0007 expecting lParam 0x20000001 got 0x60000001
msg.c:14539: Test failed: single menu item command: 3: in msg 0x0104 expecting lParam 0x20000001 got 0x60000001
msg.c:14539: Test failed: single menu item command: 4: in msg 0x0106 expecting lParam 0x20000001 got 0x60000001

w7u

Windows 7 Ultimate Japanese+IE11 / vm1Installed Internet Explorer 11 + all updates up to 2016/07/25. Inserted the MemTest86 CD. [CPU:kvm32*2cores RAM:1.5GB disk:virtio eth:e1000 snd:ich6 GPU:cirrus display:spice testagentd:1.6-detached]
comctl32:
treeview.c:2797: Test failed: parent right click sequence: the msg sequence is not complete: expected 0000 - actual 00a0
msi:
action.c:2509: Test failed: Expected 12, -12, 4, 10 or 24, got 92
action.c:2551: Test failed: Expected 12, -12, 4, 10 or 24, got 92
action.c:2620: Test failed: Expected 12, -12, 4, 10 or 24, got 92
action.c:2662: Test failed: Expected 12, -12, 4, 10 or 24, got 92
action.c:3529: Test failed: Expected 12, -12, 10 or 24, got 92
action.c:3635: Test failed: Expected 12, -12, 10 or 24, got 92
action.c:3718: Test failed: Expected 12, -12, 10 or 24, got 92
action.c:3778: Test failed: Expected 12, -12, 10 or 24, got 92
action.c:3838: Test failed: Expected 12, -20, 10 or 24, got 92
action.c:3921: Test failed: Expected 12, -12, 10 or 24, got 92

w7pro64

Windows 7 Pro 64 bit PU+IE11 / vm4Installed Internet Explorer 11 + the Platform Update + all updates up to 2014/04/15. Added .Net 4.5.1. [CPU:2*SandyBridge RAM:1GB disk:virtio eth:e1000 snd:ich6 GPU:vga display:spice testagentd:1.6-detached]
comctl32:
treeview: Timeout
dmstyle:
dmstyle.c:461: Test failed: Got valid data 0x83, expected DMUS_OBJ_OBJECT
msi:
action.c:2509: Test failed: Expected 12, -12, 4, 10 or 24, got 92
action.c:2551: Test failed: Expected 12, -12, 4, 10 or 24, got 92
action.c:2620: Test failed: Expected 12, -12, 4, 10 or 24, got 92
action.c:2662: Test failed: Expected 12, -12, 4, 10 or 24, got 92
action.c:3529: Test failed: Expected 12, -12, 10 or 24, got 92
action.c:3635: Test failed: Expected 12, -12, 10 or 24, got 92
action.c:3718: Test failed: Expected 12, -12, 10 or 24, got 92
action.c:3778: Test failed: Expected 12, -12, 10 or 24, got 92
action.c:3838: Test failed: Expected 12, -20, 10 or 24, got 92
action.c:3921: Test failed: Expected 12, -12, 10 or 24, got 92
user32:
input.c:2032: Test failed: expected WM_LBUTTONDOWN message
input.c:2033: Test failed: expected WM_LBUTTONUP message

w8

Windows 8.1 Update + IE11 / vm4Updated 2014/04/15; added Silverlight, optional DirectX components, msxml4 SP3, Visual C++ 2005 SP1 & 2010 SP1 runtimes. [CPU:core2duo*2cores RAM:1-1.5GB disk:virtio eth:e1000 snd:ich6 GPU:vga screen:spice testagentd:1.6-detached]
d3d8:
0a84:device: unhandled exception c0000005 at 00412B59
d3d9:
visual.c:8594: Test failed: Got unexpected color 0x00007580 for quad 2 (different colors).
ddraw:
d3d.c:1994: Test failed: Unexpected destination texture level pixels; 2031 differences at 0 level
d3d.c:1994: Test failed: Unexpected destination texture level pixels; 518 differences at 1 level
d3d.c:1994: Test failed: Unexpected destination texture level pixels; 138 differences at 2 level
d3d.c:1994: Test failed: Unexpected destination texture level pixels; 46 differences at 3 level
d3d.c:2178: Test failed: Unexpected destination texture level pixels; 257 differences
d3d.c:2325: Test failed: Unexpected destination texture level pixels; 256 differences at 2 level
d3d.c:2325: Test failed: Unexpected destination texture level pixels; 64 differences at 3 level
d3d.c:2325: Test failed: Unexpected destination texture level pixels; 16 differences at 4 level
d3d.c:2325: Test failed: Unexpected destination texture level pixels; 4 differences at 5 level
msi:
action.c:2509: Test failed: Expected 12, -12, 4, 10 or 24, got 92
action.c:2551: Test failed: Expected 12, -12, 4, 10 or 24, got 92
action.c:2620: Test failed: Expected 12, -12, 4, 10 or 24, got 92
action.c:2662: Test failed: Expected 12, -12, 4, 10 or 24, got 92
action.c:3529: Test failed: Expected 12, -12, 10 or 24, got 92
action.c:3635: Test failed: Expected 12, -12, 10 or 24, got 92
action.c:3718: Test failed: Expected 12, -12, 10 or 24, got 92
action.c:3778: Test failed: Expected 12, -12, 10 or 24, got 92
action.c:3838: Test failed: Expected 12, -20, 10 or 24, got 92
action.c:3921: Test failed: Expected 12, -12, 10 or 24, got 92

w864

Windows 8.1+ 64 bit+IE11 / vm3Updated 2014/04/15; added Silverlight, optional DirectX components, msxml4 SP3, Visual C++ 2005 SP1 & 2010 SP1 runtimes. [CPU:core2duo*2cores RAM:1.5GB disk:virtio eth:e1000 snd:ich6 GPU:vga display:spice testagentd:1.6-detached]
d3d10core:
06e4:device: unhandled exception c0000005 at 7FE85178
ddraw:
d3d.c:1994: Test failed: Unexpected destination texture level pixels; 2031 differences at 0 level
d3d.c:1994: Test failed: Unexpected destination texture level pixels; 518 differences at 1 level
d3d.c:1994: Test failed: Unexpected destination texture level pixels; 138 differences at 2 level
d3d.c:1994: Test failed: Unexpected destination texture level pixels; 46 differences at 3 level
d3d.c:2178: Test failed: Unexpected destination texture level pixels; 257 differences
d3d.c:2325: Test failed: Unexpected destination texture level pixels; 256 differences at 2 level
d3d.c:2325: Test failed: Unexpected destination texture level pixels; 64 differences at 3 level
d3d.c:2325: Test failed: Unexpected destination texture level pixels; 16 differences at 4 level
d3d.c:2325: Test failed: Unexpected destination texture level pixels; 4 differences at 5 level
msi:
action.c:2509: Test failed: Expected 12, -12, 4, 10 or 24, got 92
action.c:2551: Test failed: Expected 12, -12, 4, 10 or 24, got 92
action.c:2620: Test failed: Expected 12, -12, 4, 10 or 24, got 92
action.c:2662: Test failed: Expected 12, -12, 4, 10 or 24, got 92
action.c:3529: Test failed: Expected 12, -12, 10 or 24, got 92
action.c:3635: Test failed: Expected 12, -12, 10 or 24, got 92
action.c:3718: Test failed: Expected 12, -12, 10 or 24, got 92
action.c:3778: Test failed: Expected 12, -12, 10 or 24, got 92
action.c:3838: Test failed: Expected 12, -20, 10 or 24, got 92
action.c:3921: Test failed: Expected 12, -12, 10 or 24, got 92

w1064

Windows 10 64 bit / vm3Clean Windows 10 Home 64 bit installed on 2015/09/13. Added optional DirectX components. [CPU:core2duo*2cores RAM:3GB disk:virtio eth:e1000 snd:ich6 GPU:vga display:spice testagentd:1.6-detached]
d3d8:
device: Timeout
ddraw:
d3d.c:1994: Test failed: Unexpected destination texture level pixels; 2031 differences at 0 level
d3d.c:1994: Test failed: Unexpected destination texture level pixels; 518 differences at 1 level
d3d.c:1994: Test failed: Unexpected destination texture level pixels; 138 differences at 2 level
d3d.c:1994: Test failed: Unexpected destination texture level pixels; 46 differences at 3 level
d3d.c:2178: Test failed: Unexpected destination texture level pixels; 257 differences
d3d.c:2325: Test failed: Unexpected destination texture level pixels; 256 differences at 2 level
d3d.c:2325: Test failed: Unexpected destination texture level pixels; 64 differences at 3 level
d3d.c:2325: Test failed: Unexpected destination texture level pixels; 16 differences at 4 level
d3d.c:2325: Test failed: Unexpected destination texture level pixels; 4 differences at 5 level
msi:
action.c:2509: Test failed: Expected 12, -12, 4, 10 or 24, got 92
action.c:2551: Test failed: Expected 12, -12, 4, 10 or 24, got 92
action.c:2620: Test failed: Expected 12, -12, 4, 10 or 24, got 92
action.c:2662: Test failed: Expected 12, -12, 4, 10 or 24, got 92
action.c:3529: Test failed: Expected 12, -12, 10 or 24, got 92
action.c:3635: Test failed: Expected 12, -12, 10 or 24, got 92
action.c:3718: Test failed: Expected 12, -12, 10 or 24, got 92
action.c:3778: Test failed: Expected 12, -12, 10 or 24, got 92
action.c:3838: Test failed: Expected 12, -20, 10 or 24, got 92
action.c:3921: Test failed: Expected 12, -12, 10 or 24, got 92
user32:
dce.c:658: Test failed: DC for destroyed window not reused
dde: Timeout
sysparams: Timeout

kernel32:module crashed (c0000005)