Wine Test Bot
    

Job 37685 - WineTest: base VMs

Step no Task no Status VM Timeout File name Command line args Execution started Execution ended Number of test failures
1 1 completed wxppro 1800 winetest-latest.exe 0
1 2 completed w2003std 1800 winetest-latest.exe 91
1 3 completed wvistau64 1800 winetest-latest.exe 20
1 4 boterror wvistau64_zh_CN 1800 winetest-latest.exe
1 5 completed wvistau64_fr 1800 winetest-latest.exe 99
1 6 completed wvistau64_he 1800 winetest-latest.exe 4
1 7 completed w2008s64 1800 winetest-latest.exe 0
1 8 completed w7u 1800 winetest-latest.exe 1
1 9 completed w7pro64 1800 winetest-latest.exe 6
1 10 completed w8 1800 winetest-latest.exe 10
1 11 completed w864 1800 winetest-latest.exe 27
1 12 completed w1064 1800 winetest-latest.exe 37

wxppro

Windows XP Pro SP3 + IE8 / vm3Updated on 2014/04/17, added WinPcap, Silverlight, optional DirectX components, msxml4 SP3, Visual C++ 2005 SP1, 2008 SP1 and 2010 SP1 runtimes. [CPU:2*kvm32 RAM:1GB disk:virtio eth:rtl8139 snd:ac97 GPU:vga display:spice testagentd:1.6-detached]
No test failures found

w2003std

Windows 2003 Std+IE8 / vm2Installed Internet Explorer 8, SP2 and all updates up to 2015/01/23. Added .Net 2.0 SP1, 3.0 SP2, 3.5 SP2 & 4, msxml4 SP3, Visual C++ 2005 SP1, 2008 SP1 & 2010 SP1 runtimes. [CPU:2*kvm32 RAM:1GB disk:virtio eth:e1000 snd:ac97 GPU:vga display:spice testagentd:1.6-iconized]
comctl32:
treeview: Timeout
crypt32:
chain.c:4530: Test failed: ignoredInvalidDateBasePolicyCheck[0](#0001): expected 800b0101, got 800b0109
chain.c:4530: Test failed: googlePolicyCheckWithMatchingNameExpired[0](#0004): expected 800b0101, got 800b0109
chain.c:4530: Test failed: googlePolicyCheckWithMatchingName[0](#0004): expected 00000000, got 800b0109
chain.c:4530: Test failed: googlePolicyCheckWithMatchingName[0](#0004): expected 00000000, got 800b0109
chain.c:4530: Test failed: ignoredInvalidDateBasePolicyCheck[0](#0002): expected 800b0101, got 800b0109
chain: Timeout
urlmon:
protocol.c:249: Test failed: Expected ERROR_INTERNET_SEC_CERT_REV_FAILED got 12045
protocol.c:249: Test failed: Expected ERROR_INTERNET_SEC_CERT_REV_FAILED got 12045
protocol.c:249: Test failed: Expected ERROR_INTERNET_SEC_CERT_REV_FAILED got 12045
protocol.c:249: Test failed: Expected ERROR_INTERNET_SEC_CERT_REV_FAILED got 12045
protocol.c:249: Test failed: Expected ERROR_INTERNET_SEC_CERT_REV_FAILED got 12045
protocol.c:249: Test failed: Expected ERROR_INTERNET_SEC_CERT_REV_FAILED got 12045
protocol.c:249: Test failed: Expected ERROR_INTERNET_SEC_CERT_REV_FAILED got 12045
protocol.c:249: Test failed: Expected ERROR_INTERNET_SEC_CERT_REV_FAILED got 12045
protocol.c:249: Test failed: Expected ERROR_INTERNET_SEC_CERT_REV_FAILED got 12045
protocol.c:249: Test failed: Expected ERROR_INTERNET_SEC_CERT_REV_FAILED got 12045
protocol.c:249: Test failed: Expected ERROR_INTERNET_SEC_CERT_REV_FAILED got 12045
protocol.c:249: Test failed: Expected ERROR_INTERNET_SEC_CERT_REV_FAILED got 12045
protocol.c:249: Test failed: Expected ERROR_INTERNET_SEC_CERT_REV_FAILED got 12045
protocol.c:249: Test failed: Expected ERROR_INTERNET_SEC_CERT_REV_FAILED got 12045
protocol.c:249: Test failed: Expected ERROR_INTERNET_SEC_CERT_REV_FAILED got 12045
protocol.c:249: Test failed: Expected ERROR_INTERNET_SEC_CERT_REV_FAILED got 12045
protocol.c:249: Test failed: Expected ERROR_INTERNET_SEC_CERT_REV_FAILED got 12045
protocol.c:249: Test failed: Expected ERROR_INTERNET_SEC_CERT_REV_FAILED got 12045
protocol.c:249: Test failed: Expected ERROR_INTERNET_SEC_CERT_REV_FAILED got 12045
protocol.c:249: Test failed: Expected ERROR_INTERNET_SEC_CERT_REV_FAILED got 12045
protocol.c:249: Test failed: Expected ERROR_INTERNET_SEC_CERT_REV_FAILED got 12045
protocol.c:249: Test failed: Expected ERROR_INTERNET_SEC_CERT_REV_FAILED got 12045
protocol.c:249: Test failed: Expected ERROR_INTERNET_SEC_CERT_REV_FAILED got 12045
protocol.c:249: Test failed: Expected ERROR_INTERNET_SEC_CERT_REV_FAILED got 12045
protocol.c:249: Test failed: Expected ERROR_INTERNET_SEC_CERT_REV_FAILED got 12045
protocol.c:249: Test failed: Expected ERROR_INTERNET_SEC_CERT_REV_FAILED got 12045
protocol.c:249: Test failed: Expected ERROR_INTERNET_SEC_CERT_REV_FAILED got 12045
protocol.c:249: Test failed: Expected ERROR_INTERNET_SEC_CERT_REV_FAILED got 12045
protocol.c:249: Test failed: Expected ERROR_INTERNET_SEC_CERT_REV_FAILED got 12045
protocol.c:249: Test failed: Expected ERROR_INTERNET_SEC_CERT_REV_FAILED got 12045
protocol.c:249: Test failed: Expected ERROR_INTERNET_SEC_CERT_REV_FAILED got 12045
protocol.c:249: Test failed: Expected ERROR_INTERNET_SEC_CERT_REV_FAILED got 12045
protocol.c:249: Test failed: Expected ERROR_INTERNET_SEC_CERT_REV_FAILED got 12045
protocol.c:249: Test failed: Expected ERROR_INTERNET_SEC_CERT_REV_FAILED got 12045
protocol.c:249: Test failed: Expected ERROR_INTERNET_SEC_CERT_REV_FAILED got 12045
protocol.c:249: Test failed: Expected ERROR_INTERNET_SEC_CERT_REV_FAILED got 12045
protocol.c:249: Test failed: Expected ERROR_INTERNET_SEC_CERT_REV_FAILED got 12045
protocol.c:249: Test failed: Expected ERROR_INTERNET_SEC_CERT_REV_FAILED got 12045
protocol.c:249: Test failed: Expected ERROR_INTERNET_SEC_CERT_REV_FAILED got 12045
protocol.c:249: Test failed: Expected ERROR_INTERNET_SEC_CERT_REV_FAILED got 12045
protocol.c:249: Test failed: Expected ERROR_INTERNET_SEC_CERT_REV_FAILED got 12045
protocol.c:249: Test failed: Expected ERROR_INTERNET_SEC_CERT_REV_FAILED got 12045
protocol.c:249: Test failed: Expected ERROR_INTERNET_SEC_CERT_REV_FAILED got 12045
protocol.c:249: Test failed: Expected ERROR_INTERNET_SEC_CERT_REV_FAILED got 12045
protocol.c:249: Test failed: Expected ERROR_INTERNET_SEC_CERT_REV_FAILED got 12045
protocol.c:249: Test failed: Expected ERROR_INTERNET_SEC_CERT_REV_FAILED got 12045
protocol.c:249: Test failed: Expected ERROR_INTERNET_SEC_CERT_REV_FAILED got 12045
protocol.c:249: Test failed: Expected ERROR_INTERNET_SEC_CERT_REV_FAILED got 12045
protocol.c:249: Test failed: Expected ERROR_INTERNET_SEC_CERT_REV_FAILED got 12045
protocol.c:249: Test failed: Expected ERROR_INTERNET_SEC_CERT_REV_FAILED got 12045
protocol.c:249: Test failed: Expected ERROR_INTERNET_SEC_CERT_REV_FAILED got 12045
protocol.c:249: Test failed: Expected ERROR_INTERNET_SEC_CERT_REV_FAILED got 12045
protocol.c:249: Test failed: Expected ERROR_INTERNET_SEC_CERT_REV_FAILED got 12045
protocol.c:249: Test failed: Expected ERROR_INTERNET_SEC_CERT_REV_FAILED got 12045
protocol.c:249: Test failed: Expected ERROR_INTERNET_SEC_CERT_REV_FAILED got 12045
protocol.c:249: Test failed: Expected ERROR_INTERNET_SEC_CERT_REV_FAILED got 12045
protocol.c:249: Test failed: Expected ERROR_INTERNET_SEC_CERT_REV_FAILED got 12045
protocol.c:249: Test failed: Expected ERROR_INTERNET_SEC_CERT_REV_FAILED got 12045
protocol.c:249: Test failed: Expected ERROR_INTERNET_SEC_CERT_REV_FAILED got 12045
protocol.c:249: Test failed: Expected ERROR_INTERNET_SEC_CERT_REV_FAILED got 12045
protocol.c:249: Test failed: Expected ERROR_INTERNET_SEC_CERT_REV_FAILED got 12045
protocol.c:249: Test failed: Expected ERROR_INTERNET_SEC_CERT_REV_FAILED got 12045
protocol.c:249: Test failed: Expected ERROR_INTERNET_SEC_CERT_REV_FAILED got 12045
protocol.c:249: Test failed: Expected ERROR_INTERNET_SEC_CERT_REV_FAILED got 12045
protocol.c:249: Test failed: Expected ERROR_INTERNET_SEC_CERT_REV_FAILED got 12045
protocol.c:249: Test failed: Expected ERROR_INTERNET_SEC_CERT_REV_FAILED got 12045
protocol.c:249: Test failed: Expected ERROR_INTERNET_SEC_CERT_REV_FAILED got 12045
protocol.c:249: Test failed: Expected ERROR_INTERNET_SEC_CERT_REV_FAILED got 12045
protocol.c:249: Test failed: Expected ERROR_INTERNET_SEC_CERT_REV_FAILED got 12045
protocol.c:249: Test failed: Expected ERROR_INTERNET_SEC_CERT_REV_FAILED got 12045
protocol.c:249: Test failed: Expected ERROR_INTERNET_SEC_CERT_REV_FAILED got 12045
protocol.c:249: Test failed: Expected ERROR_INTERNET_SEC_CERT_REV_FAILED got 12045
protocol.c:249: Test failed: Expected ERROR_INTERNET_SEC_CERT_REV_FAILED got 12045
protocol.c:249: Test failed: Expected ERROR_INTERNET_SEC_CERT_REV_FAILED got 12045
protocol.c:249: Test failed: Expected ERROR_INTERNET_SEC_CERT_REV_FAILED got 12045
protocol.c:249: Test failed: Expected ERROR_INTERNET_SEC_CERT_REV_FAILED got 12045
protocol.c:249: Test failed: Expected ERROR_INTERNET_SEC_CERT_REV_FAILED got 12045
protocol.c:249: Test failed: Expected ERROR_INTERNET_SEC_CERT_REV_FAILED got 12045
protocol.c:249: Test failed: Expected ERROR_INTERNET_SEC_CERT_REV_FAILED got 12045
protocol.c:249: Test failed: Expected ERROR_INTERNET_SEC_CERT_REV_FAILED got 12045
protocol.c:249: Test failed: Expected ERROR_INTERNET_SEC_CERT_REV_FAILED got 12045
protocol: Timeout
url.c:3895: Test failed: request failed: 12045
wmp:
0188:oleobj: unhandled exception c0000005 at 4F9456CB

wvistau64

Vista Ultimate 64 bit English+IE8 / vm2Updated on 2014/04/21. Running tests from E: drive. Added WinPcap, Silverlight, optional DirectX components, msxml4 SP3, Visual C++ 2005/2008/2010 SP1, 2012/2013/2015 runtimes. [CPU:2*kvm64 RAM:1GB disks:2*virtio eth:e1000 snd:none GPU:vga display:VNC testagentd:1.6-detached]
user32:
win.c:9796: Test failed: GetActiveWindow() = 000505C4
win.c:9796: Test failed: GetFocus() = 00000000
win.c:9798: Test failed: expected 000505C4, got 010E0352
win.c:9801: Test failed: GetActiveWindow() = 000505C4
win.c:9801: Test failed: GetFocus() = 00000000
win.c:9802: Test failed: expected 000505C4, got 010E0352
win.c:9824: Test failed: GetActiveWindow() = 000505C4
win.c:9824: Test failed: GetFocus() = 00000000
win.c:9826: Test failed: expected 000505C4, got 000B261A
win.c:9827: Test failed: expected 000B261A, got 000327AE
win.c:9840: Test failed: GetActiveWindow() = 000505C4
win.c:9840: Test failed: GetFocus() = 00000000
win.c:9847: Test failed: GetFocus() = 00000000
win.c:9858: Test failed: GetActiveWindow() = 000417A4
win.c:9858: Test failed: GetFocus() = 00000000
win.c:9869: Test failed: GetFocus() = 00000000
wmp:
media.c:147: Test failed: unexpected event for  OPENSTATE, index:6
media.c:147: Test failed: unexpected event for  OPENSTATE, index:8
media.c:147: Test failed: unexpected event for  OPENSTATE, index:6
media.c:152: Test failed: unexpected event for  PLAYSTATE, index:10

wvistau64_zh_CN

Vista Ultimate 64 bit Chinese+IE8 / vm2Updated on 2014/04/21. Running tests from E: drive. Added WinPcap, Silverlight, optional DirectX components, msxml4 SP3, Visual C++ 2005/2008/2010 SP1, 2012/2013/2015 runtimes. [CPU:2*kvm64 RAM:1GB disks:2*virtio eth:e1000 snd:none GPU:vga display:VNC testagentd:1.6-detached]
An error occurred while retrieving the test report: unable to open 'wvistau64_zh_CN.rpt' for reading: No such file or directory
The test VM has crashed, rebooted or lost connectivity (or the TestAgent server died)
Giving up after 3 run(s)

wvistau64_fr

Vista Ultimate 64 bit French+IE8 / vm2Updated on 2014/04/21. Running tests from E: drive. Added WinPcap, Silverlight, optional DirectX components, msxml4 SP3, Visual C++ 2005/2008/2010 SP1, 2012/2013/2015 runtimes. [CPU:2*kvm64 RAM:1GB disks:2*virtio eth:e1000 snd:none GPU:vga display:VNC testagentd:1.6-detached]
gdi32:
font.c:5535: Test failed: Arial: style names don't match: returned Regular, expect Normal
font.c:5535: Test failed: Arial: style names don't match: returned Regular, expect Normal
font.c:5535: Test failed: Arial: style names don't match: returned Regular, expect Normal
font.c:5535: Test failed: Arial: style names don't match: returned Regular, expect Normal
font.c:5535: Test failed: Arial: style names don't match: returned Regular, expect Normal
font.c:5535: Test failed: Arial: style names don't match: returned Regular, expect Normal
font.c:5535: Test failed: Arial: style names don't match: returned Regular, expect Normal
font.c:5535: Test failed: Arial: style names don't match: returned Regular, expect Normal
font.c:5535: Test failed: Arial: style names don't match: returned Regular, expect Normal
font.c:5525: Test failed: Arial: font face names don't match: returned Arial Italic, expect Arial Italique
font.c:5535: Test failed: Arial: style names don't match: returned Italic, expect Italique
font.c:5525: Test failed: Arial: font face names don't match: returned Arial Italic, expect Arial Italique
font.c:5535: Test failed: Arial: style names don't match: returned Italic, expect Italique
font.c:5525: Test failed: Arial: font face names don't match: returned Arial Italic, expect Arial Italique
font.c:5535: Test failed: Arial: style names don't match: returned Italic, expect Italique
font.c:5525: Test failed: Arial: font face names don't match: returned Arial Italic, expect Arial Italique
font.c:5535: Test failed: Arial: style names don't match: returned Italic, expect Italique
font.c:5525: Test failed: Arial: font face names don't match: returned Arial Italic, expect Arial Italique
font.c:5535: Test failed: Arial: style names don't match: returned Italic, expect Italique
font.c:5525: Test failed: Arial: font face names don't match: returned Arial Italic, expect Arial Italique
font.c:5535: Test failed: Arial: style names don't match: returned Italic, expect Italique
font.c:5525: Test failed: Arial: font face names don't match: returned Arial Italic, expect Arial Italique
font.c:5535: Test failed: Arial: style names don't match: returned Italic, expect Italique
font.c:5525: Test failed: Arial: font face names don't match: returned Arial Italic, expect Arial Italique
font.c:5535: Test failed: Arial: style names don't match: returned Italic, expect Italique
font.c:5525: Test failed: Arial: font face names don't match: returned Arial Bold, expect Arial Gras
font.c:5535: Test failed: Arial: style names don't match: returned Bold, expect Gras
font.c:5525: Test failed: Arial: font face names don't match: returned Arial Bold, expect Arial Gras
font.c:5535: Test failed: Arial: style names don't match: returned Bold, expect Gras
font.c:5525: Test failed: Arial: font face names don't match: returned Arial Bold, expect Arial Gras
font.c:5535: Test failed: Arial: style names don't match: returned Bold, expect Gras
font.c:5525: Test failed: Arial: font face names don't match: returned Arial Bold, expect Arial Gras
font.c:5535: Test failed: Arial: style names don't match: returned Bold, expect Gras
font.c:5525: Test failed: Arial: font face names don't match: returned Arial Bold, expect Arial Gras
font.c:5535: Test failed: Arial: style names don't match: returned Bold, expect Gras
font.c:5525: Test failed: Arial: font face names don't match: returned Arial Bold, expect Arial Gras
font.c:5535: Test failed: Arial: style names don't match: returned Bold, expect Gras
font.c:5525: Test failed: Arial: font face names don't match: returned Arial Bold, expect Arial Gras
font.c:5535: Test failed: Arial: style names don't match: returned Bold, expect Gras
font.c:5525: Test failed: Arial: font face names don't match: returned Arial Bold, expect Arial Gras
font.c:5535: Test failed: Arial: style names don't match: returned Bold, expect Gras
font.c:5525: Test failed: Arial: font face names don't match: returned Arial Bold, expect Arial Gras
font.c:5535: Test failed: Arial: style names don't match: returned Bold, expect Gras
font.c:5525: Test failed: Arial: font face names don't match: returned Arial Bold Italic, expect Arial Gras Italique
font.c:5535: Test failed: Arial: style names don't match: returned Bold Italic, expect Gras Italique
font.c:5525: Test failed: Arial: font face names don't match: returned Arial Bold Italic, expect Arial Gras Italique
font.c:5535: Test failed: Arial: style names don't match: returned Bold Italic, expect Gras Italique
font.c:5525: Test failed: Arial: font face names don't match: returned Arial Bold Italic, expect Arial Gras Italique
font.c:5535: Test failed: Arial: style names don't match: returned Bold Italic, expect Gras Italique
font.c:5525: Test failed: Arial: font face names don't match: returned Arial Bold Italic, expect Arial Gras Italique
font.c:5535: Test failed: Arial: style names don't match: returned Bold Italic, expect Gras Italique
font.c:5525: Test failed: Arial: font face names don't match: returned Arial Bold Italic, expect Arial Gras Italique
font.c:5535: Test failed: Arial: style names don't match: returned Bold Italic, expect Gras Italique
font.c:5525: Test failed: Arial: font face names don't match: returned Arial Bold Italic, expect Arial Gras Italique
font.c:5535: Test failed: Arial: style names don't match: returned Bold Italic, expect Gras Italique
font.c:5525: Test failed: Arial: font face names don't match: returned Arial Bold Italic, expect Arial Gras Italique
font.c:5535: Test failed: Arial: style names don't match: returned Bold Italic, expect Gras Italique
font.c:5525: Test failed: Arial: font face names don't match: returned Arial Bold Italic, expect Arial Gras Italique
font.c:5535: Test failed: Arial: style names don't match: returned Bold Italic, expect Gras Italique
font.c:5535: Test failed: Tahoma: style names don't match: returned Regular, expect Normal
font.c:5535: Test failed: Tahoma: style names don't match: returned Regular, expect Normal
font.c:5535: Test failed: Tahoma: style names don't match: returned Regular, expect Normal
font.c:5535: Test failed: Tahoma: style names don't match: returned Regular, expect Normal
font.c:5535: Test failed: Tahoma: style names don't match: returned Regular, expect Normal
font.c:5535: Test failed: Tahoma: style names don't match: returned Regular, expect Normal
font.c:5535: Test failed: Tahoma: style names don't match: returned Regular, expect Normal
font.c:5535: Test failed: Tahoma: style names don't match: returned Regular, expect Normal
font.c:5535: Test failed: Tahoma: style names don't match: returned Regular, expect Normal
font.c:5535: Test failed: Tahoma: style names don't match: returned Regular, expect Normal
font.c:5525: Test failed: Tahoma: font face names don't match: returned Tahoma Bold, expect Tahoma Gras
font.c:5535: Test failed: Tahoma: style names don't match: returned Bold, expect Gras
font.c:5525: Test failed: Tahoma: font face names don't match: returned Tahoma Bold, expect Tahoma Gras
font.c:5535: Test failed: Tahoma: style names don't match: returned Bold, expect Gras
font.c:5525: Test failed: Tahoma: font face names don't match: returned Tahoma Bold, expect Tahoma Gras
font.c:5535: Test failed: Tahoma: style names don't match: returned Bold, expect Gras
font.c:5525: Test failed: Tahoma: font face names don't match: returned Tahoma Bold, expect Tahoma Gras
font.c:5535: Test failed: Tahoma: style names don't match: returned Bold, expect Gras
font.c:5525: Test failed: Tahoma: font face names don't match: returned Tahoma Bold, expect Tahoma Gras
font.c:5535: Test failed: Tahoma: style names don't match: returned Bold, expect Gras
font.c:5525: Test failed: Tahoma: font face names don't match: returned Tahoma Bold, expect Tahoma Gras
font.c:5535: Test failed: Tahoma: style names don't match: returned Bold, expect Gras
font.c:5525: Test failed: Tahoma: font face names don't match: returned Tahoma Bold, expect Tahoma Gras
font.c:5535: Test failed: Tahoma: style names don't match: returned Bold, expect Gras
font.c:5525: Test failed: Tahoma: font face names don't match: returned Tahoma Bold, expect Tahoma Gras
font.c:5535: Test failed: Tahoma: style names don't match: returned Bold, expect Gras
font.c:5525: Test failed: Tahoma: font face names don't match: returned Tahoma Bold, expect Tahoma Gras
font.c:5535: Test failed: Tahoma: style names don't match: returned Bold, expect Gras
font.c:5525: Test failed: Tahoma: font face names don't match: returned Tahoma Bold, expect Tahoma Gras
font.c:5535: Test failed: Tahoma: style names don't match: returned Bold, expect Gras
font.c:5535: Test failed: Webdings: style names don't match: returned Regular, expect Normal
font.c:5535: Test failed: Wingdings: style names don't match: returned Regular, expect Normal
wininet:
ftp.c:81: Test failed: Expected ERROR_INTERNET_LOGIN_FAILURE, got 12111
ftp.c:112: Test failed: InternetConnect failed : 12111
ftp.c:113: Test failed: ERROR_SUCCESS, got 12111
ftp.c:122: Test failed: Expected ERROR_INTERNET_LOGIN_FAILURE, got 12111
wmp:
media.c:147: Test failed: unexpected event for  OPENSTATE, index:6
media.c:147: Test failed: unexpected event for  OPENSTATE, index:8
media.c:147: Test failed: unexpected event for  OPENSTATE, index:6
media.c:152: Test failed: unexpected event for  PLAYSTATE, index:10

wvistau64_he

Vista Ultimate 64 bit Hebrew+IE8 / vm2Updated on 2014/04/21. Running tests from E: drive. Added WinPcap, Silverlight, optional DirectX components, msxml4 SP3, Visual C++ 2005/2008/2010 SP1, 2012/2013/2015 runtimes. [CPU:2*kvm64 RAM:1GB disks:2*virtio eth:e1000 snd:none GPU:vga display:VNC testagentd:1.6-iconized]
wmp:
media.c:147: Test failed: unexpected event for  OPENSTATE, index:6
media.c:147: Test failed: unexpected event for  OPENSTATE, index:8
media.c:147: Test failed: unexpected event for  OPENSTATE, index:6
media.c:152: Test failed: unexpected event for  PLAYSTATE, index:10

w2008s64

Win Server 2008 Std 64-bit PU+IE9 / vm2Upgraded with Internet Explorer 9, .Net Framework 3.5 SP1 & 4.5.1 and all updates up to 2013/04/15. Added Visual C++ 2012 & 2013 runtimes. [CPU:2*kvm64 RAM:1GB disk:virtio eth:2*e1000 snd:none GPU:vga display:VNC testagentd:1.5-iconized]
No test failures found

w7u

Windows 7 Ultimate Japanese+IE11 / vm1Installed Internet Explorer 11 + all updates up to 2016/07/25. Inserted the MemTest86 CD. [CPU:kvm32*2cores RAM:1.5GB disk:virtio eth:e1000 snd:ich6 GPU:cirrus display:spice testagentd:1.6-detached]
comctl32:
treeview: Timeout

w7pro64

Windows 7 Pro 64 bit PU+IE11 / vm4Installed Internet Explorer 11 + the Platform Update + all updates up to 2014/04/15. Added .Net 4.5.1. [CPU:2*SandyBridge RAM:1GB disk:virtio eth:e1000 snd:ich6 GPU:vga display:spice testagentd:1.6-detached]
comctl32:
treeview: Timeout
dmstyle:
dmstyle.c:461: Test failed: Got valid data 0x83, expected DMUS_OBJ_OBJECT
kernel32:
comm.c:861: Test failed: WaitCommEvent failed with a timeout
comm.c:882: Test failed: WaitCommEvent error 0
comm.c:883: Test failed: WaitCommEvent: expected EV_TXEMPTY, got 0
comm.c:888: Test failed: WaitCommEvent used 1513 ms for waiting

w8

Windows 8.1 Update + IE11 / vm4Updated 2014/04/15; added Silverlight, optional DirectX components, msxml4 SP3, Visual C++ 2005 SP1 & 2010 SP1 runtimes. [CPU:core2duo*2cores RAM:1-1.5GB disk:virtio eth:e1000 snd:ich6 GPU:vga screen:spice testagentd:1.6-detached]
d3d8:
0a74:device: unhandled exception c0000005 at 00412B59
ddraw:
d3d.c:1994: Test failed: Unexpected destination texture level pixels; 2031 differences at 0 level
d3d.c:1994: Test failed: Unexpected destination texture level pixels; 518 differences at 1 level
d3d.c:1994: Test failed: Unexpected destination texture level pixels; 138 differences at 2 level
d3d.c:1994: Test failed: Unexpected destination texture level pixels; 46 differences at 3 level
d3d.c:2178: Test failed: Unexpected destination texture level pixels; 257 differences
d3d.c:2325: Test failed: Unexpected destination texture level pixels; 256 differences at 2 level
d3d.c:2325: Test failed: Unexpected destination texture level pixels; 64 differences at 3 level
d3d.c:2325: Test failed: Unexpected destination texture level pixels; 16 differences at 4 level
d3d.c:2325: Test failed: Unexpected destination texture level pixels; 4 differences at 5 level

w864

Windows 8.1+ 64 bit+IE11 / vm3Updated 2014/04/15; added Silverlight, optional DirectX components, msxml4 SP3, Visual C++ 2005 SP1 & 2010 SP1 runtimes. [CPU:core2duo*2cores RAM:1.5GB disk:virtio eth:e1000 snd:ich6 GPU:vga display:spice testagentd:1.6-detached]
ddraw:
d3d.c:1994: Test failed: Unexpected destination texture level pixels; 2031 differences at 0 level
d3d.c:1994: Test failed: Unexpected destination texture level pixels; 518 differences at 1 level
d3d.c:1994: Test failed: Unexpected destination texture level pixels; 138 differences at 2 level
d3d.c:1994: Test failed: Unexpected destination texture level pixels; 46 differences at 3 level
d3d.c:2178: Test failed: Unexpected destination texture level pixels; 257 differences
d3d.c:2325: Test failed: Unexpected destination texture level pixels; 256 differences at 2 level
d3d.c:2325: Test failed: Unexpected destination texture level pixels; 64 differences at 3 level
d3d.c:2325: Test failed: Unexpected destination texture level pixels; 16 differences at 4 level
d3d.c:2325: Test failed: Unexpected destination texture level pixels; 4 differences at 5 level
ddraw4.c:2936: Test failed: Expected message 0x46, but didn't receive it.
ddraw4.c:2938: Test failed: Expected screen size 1024x768, got 0x0.
ddraw4.c:2944: Test failed: Expected (0,0)-(1024,768), got (-8,-8)-(1032,736).
ddraw4.c:2974: Test failed: Expected (0,0)-(1024,768), got (-8,-8)-(1032,736).
ddraw4.c:2981: Test failed: Expected (0,0)-(1024,768), got (-8,-8)-(1032,736).
ddraw4.c:3007: Test failed: Expected (0,0)-(1024,768), got (-8,-8)-(1032,736).
ddraw4.c:3030: Test failed: Expected (0,0)-(1024,768), got (-8,-8)-(1032,736).
ddraw4.c:3052: Test failed: Expected (0,0)-(1024,768), got (-8,-8)-(1032,736).
ddraw4.c:3078: Test failed: Expected (0,0)-(1024,768), got (-8,-8)-(1032,736).
ddraw4.c:3098: Test failed: Expected (0,0)-(1024,768), got (-8,-8)-(1032,736).
ddraw4.c:3134: Test failed: Expected (0,0)-(1024,768), got (-8,-8)-(1032,736).
ddraw4.c:3144: Test failed: Expected (0,0)-(1024,768), got (-8,-8)-(1032,736).
ddraw4.c:3170: Test failed: Expected (0,0)-(1024,768), got (-8,-8)-(1032,736).
ddraw4.c:3193: Test failed: Expected (0,0)-(1024,768), got (-8,-8)-(1032,736).
ddraw4.c:3215: Test failed: Expected (0,0)-(1024,768), got (-8,-8)-(1032,736).
ddraw4.c:3241: Test failed: Expected (0,0)-(1024,768), got (-8,-8)-(1032,736).
ddraw4.c:3261: Test failed: Expected (0,0)-(1024,768), got (-8,-8)-(1032,736).
ddraw4.c:3298: Test failed: Expected (0,0)-(1024,768), got (-8,-8)-(1032,736).

w1064

Windows 10 64 bit / vm3Clean Windows 10 Home 64 bit installed on 2015/09/13. Added optional DirectX components. [CPU:core2duo*2cores RAM:3GB disk:virtio eth:e1000 snd:ich6 GPU:vga display:spice testagentd:1.6-detached]
d3d8:
device: Timeout
ddraw:
d3d.c:1994: Test failed: Unexpected destination texture level pixels; 2031 differences at 0 level
d3d.c:1994: Test failed: Unexpected destination texture level pixels; 518 differences at 1 level
d3d.c:1994: Test failed: Unexpected destination texture level pixels; 138 differences at 2 level
d3d.c:1994: Test failed: Unexpected destination texture level pixels; 46 differences at 3 level
d3d.c:2178: Test failed: Unexpected destination texture level pixels; 257 differences
d3d.c:2325: Test failed: Unexpected destination texture level pixels; 256 differences at 2 level
d3d.c:2325: Test failed: Unexpected destination texture level pixels; 64 differences at 3 level
d3d.c:2325: Test failed: Unexpected destination texture level pixels; 16 differences at 4 level
d3d.c:2325: Test failed: Unexpected destination texture level pixels; 4 differences at 5 level
user32:
broadcast.c:134: Test failed: Returned: 0
broadcast.c:135: Test failed: Asynchronous message sent instead
broadcast.c:154: Test failed: Asynchronous message sent instead
broadcast.c:159: Test failed: Returned: 0
broadcast.c:160: Test failed: Asynchronous message sent instead
broadcast.c:134: Test failed: Returned: 0
broadcast.c:135: Test failed: Asynchronous message sent instead
broadcast.c:154: Test failed: Asynchronous message sent instead
broadcast.c:159: Test failed: Returned: 0
broadcast.c:160: Test failed: Asynchronous message sent instead
broadcast.c:215: Test failed: Returned: 0
broadcast.c:216: Test failed: Asynchronous message sent instead
broadcast.c:234: Test failed: Asynchronous message sent instead
broadcast.c:239: Test failed: Returned: 0
broadcast.c:240: Test failed: Asynchronous message sent instead
broadcast.c:215: Test failed: Returned: 0
broadcast.c:216: Test failed: Asynchronous message sent instead
broadcast.c:234: Test failed: Asynchronous message sent instead
broadcast.c:239: Test failed: Returned: 0
broadcast.c:240: Test failed: Asynchronous message sent instead
broadcast.c:269: Test failed: Returned: 0 error 1314
broadcast.c:270: Test failed: Asynchronous message sent instead
broadcast.c:280: Test failed: Returned: 0 error 3405691582
broadcast.c:281: Test failed: Asynchronous message sent instead
broadcast.c:291: Test failed: Returned: 0 error 1314
broadcast.c:292: Test failed: Asynchronous message sent instead
broadcast.c:303: Test failed: Asynchronous message sent instead