Wine Test Bot
    

Job 35300 - WineTest: 64-bit VMs

Step no Task no Status VM Timeout File name Command line args Execution started Execution ended Number of test failures
1 1 completed wvistau64 1800 winetest64-latest.exe 0
1 2 completed w2008s64 1800 winetest64-latest.exe 0
1 3 completed w7pro64 1800 winetest64-latest.exe 1
1 4 completed w864 1800 winetest64-latest.exe 769
1 5 completed w1064 1800 winetest64-latest.exe 84

wvistau64

No test failures found

w2008s64

No test failures found

w7pro64

mmdevapi:
capture.c:181: Test failed: Position 375 expected 0

w864

msi:
action: Timeout
install.c:2624: Test failed: Expected ERROR_PATH_NOT_FOUND, got 1618
install.c:2637: Test failed: Expected ERROR_SUCCESS, got 1618
install.c:2445: Test failed: File not installed
install.c:2446: Test failed: Directory not created
install.c:2447: Test failed: File not installed
install.c:2448: Test failed: Directory not created
install.c:2449: Test failed: File not installed
install.c:2450: Test failed: Directory not created
install.c:2451: Test failed: File not installed
install.c:2452: Test failed: Directory not created
install.c:2453: Test failed: File not installed
install.c:2454: Test failed: File not installed
install.c:2455: Test failed: File not installed
install.c:2456: Test failed: Directory not created
install.c:2642: Test failed: Expected ERROR_SUCCESS, got 2
install.c:2647: Test failed: Expected ERROR_SUCCESS, got 6
install.c:2648: Test failed: Expected imaname, got A]R
install.c:2653: Test failed: Expected ERROR_FILE_NOT_FOUND, got 6
install.c:2658: Test failed: Expected ERROR_SUCCESS, got 6
install.c:2659: Test failed: Expected 314, got 103
install.c:2664: Test failed: Expected ERROR_SUCCESS, got 6
install.c:2665: Test failed: Expected OrderTestValue, got A]R
install.c:2555: Test failed: Failed to open TestService
install.c:2558: Test failed: Failed to delete TestService
install.c:2673: Test failed: Expected ERROR_SUCCESS, got 1618
install.c:2445: Test failed: File not installed
install.c:2446: Test failed: Directory not created
install.c:2447: Test failed: File not installed
install.c:2448: Test failed: Directory not created
install.c:2449: Test failed: File not installed
install.c:2450: Test failed: Directory not created
install.c:2451: Test failed: File not installed
install.c:2452: Test failed: Directory not created
install.c:2453: Test failed: File not installed
install.c:2454: Test failed: File not installed
install.c:2455: Test failed: File not installed
install.c:2456: Test failed: Directory not created
install.c:2678: Test failed: Expected ERROR_SUCCESS, got 2
install.c:2685: Test failed: Expected ERROR_SUCCESS, got 1618
install.c:2445: Test failed: File not installed
install.c:2446: Test failed: Directory not created
install.c:2447: Test failed: File not installed
install.c:2448: Test failed: Directory not created
install.c:2449: Test failed: File not installed
install.c:2450: Test failed: Directory not created
install.c:2451: Test failed: File not installed
install.c:2452: Test failed: Directory not created
install.c:2453: Test failed: File not installed
install.c:2454: Test failed: File not installed
install.c:2455: Test failed: File not installed
install.c:2456: Test failed: Directory not created
install.c:2690: Test failed: Expected ERROR_SUCCESS, got 2
install.c:2697: Test failed: Expected ERROR_SUCCESS, got 1618
install.c:2445: Test failed: File not installed
install.c:2446: Test failed: Directory not created
install.c:2447: Test failed: File not installed
install.c:2448: Test failed: Directory not created
install.c:2449: Test failed: File not installed
install.c:2450: Test failed: Directory not created
install.c:2451: Test failed: File not installed
install.c:2452: Test failed: Directory not created
install.c:2453: Test failed: File not installed
install.c:2454: Test failed: File not installed
install.c:2455: Test failed: File not installed
install.c:2456: Test failed: Directory not created
install.c:2702: Test failed: Expected ERROR_SUCCESS, got 2
install.c:2709: Test failed: Expected ERROR_SUCCESS, got 1618
install.c:2445: Test failed: File not installed
install.c:2446: Test failed: Directory not created
install.c:2447: Test failed: File not installed
install.c:2448: Test failed: Directory not created
install.c:2449: Test failed: File not installed
install.c:2450: Test failed: Directory not created
install.c:2451: Test failed: File not installed
install.c:2452: Test failed: Directory not created
install.c:2453: Test failed: File not installed
install.c:2454: Test failed: File not installed
install.c:2455: Test failed: File not installed
install.c:2456: Test failed: Directory not created
install.c:2714: Test failed: Expected ERROR_SUCCESS, got 2
install.c:2721: Test failed: Expected ERROR_SUCCESS, got 1618
install.c:2445: Test failed: File not installed
install.c:2446: Test failed: Directory not created
install.c:2447: Test failed: File not installed
install.c:2448: Test failed: Directory not created
install.c:2449: Test failed: File not installed
install.c:2450: Test failed: Directory not created
install.c:2451: Test failed: File not installed
install.c:2452: Test failed: Directory not created
install.c:2453: Test failed: File not installed
install.c:2454: Test failed: File not installed
install.c:2455: Test failed: File not installed
install.c:2456: Test failed: Directory not created
install.c:2732: Test failed: Expected ERROR_SUCCESS, got 1618
install.c:2445: Test failed: File not installed
install.c:2446: Test failed: Directory not created
install.c:2447: Test failed: File not installed
install.c:2448: Test failed: Directory not created
install.c:2449: Test failed: File not installed
install.c:2450: Test failed: Directory not created
install.c:2451: Test failed: File not installed
install.c:2452: Test failed: Directory not created
install.c:2453: Test failed: File not installed
install.c:2454: Test failed: File not installed
install.c:2455: Test failed: File not installed
install.c:2456: Test failed: Directory not created
install.c:2743: Test failed: Expected ERROR_SUCCESS, got 1618
install.c:2445: Test failed: File not installed
install.c:2446: Test failed: Directory not created
install.c:2447: Test failed: File not installed
install.c:2448: Test failed: Directory not created
install.c:2449: Test failed: File not installed
install.c:2450: Test failed: Directory not created
install.c:2451: Test failed: File not installed
install.c:2452: Test failed: Directory not created
install.c:2453: Test failed: File not installed
install.c:2454: Test failed: File not installed
install.c:2455: Test failed: File not installed
install.c:2456: Test failed: Directory not created
install.c:2754: Test failed: Expected ERROR_SUCCESS, got 1618
install.c:2445: Test failed: File not installed
install.c:2446: Test failed: Directory not created
install.c:2447: Test failed: File not installed
install.c:2448: Test failed: Directory not created
install.c:2449: Test failed: File not installed
install.c:2450: Test failed: Directory not created
install.c:2451: Test failed: File not installed
install.c:2452: Test failed: Directory not created
install.c:2453: Test failed: File not installed
install.c:2454: Test failed: File not installed
install.c:2455: Test failed: File not installed
install.c:2456: Test failed: Directory not created
install.c:2765: Test failed: Expected ERROR_SUCCESS, got 1618
install.c:2445: Test failed: File not installed
install.c:2446: Test failed: Directory not created
install.c:2447: Test failed: File not installed
install.c:2448: Test failed: Directory not created
install.c:2449: Test failed: File not installed
install.c:2450: Test failed: Directory not created
install.c:2451: Test failed: File not installed
install.c:2452: Test failed: Directory not created
install.c:2453: Test failed: File not installed
install.c:2454: Test failed: File not installed
install.c:2455: Test failed: File not installed
install.c:2456: Test failed: Directory not created
install.c:2773: Test failed: Expected ERROR_SUCCESS, got 1618
install.c:2968: Test failed: Expected ERROR_SUCCESS, got 1618
install.c:2969: Test failed: File not installed
install.c:2970: Test failed: File not installed
install.c:2971: Test failed: File not installed
install.c:2972: Test failed: Directory not created
install.c:2990: Test failed: Expected ERROR_SUCCESS, got 1618
install.c:2991: Test failed: File not installed
install.c:2993: Test failed: File not installed
install.c:2994: Test failed: File not installed
install.c:2995: Test failed: Directory not created
install.c:3016: Test failed: Expected ERROR_INSTALL_FAILURE, got 1618
install.c:3040: Test failed: Expected ERROR_SUCCESS, got 1618
install.c:3041: Test failed: File not installed
install.c:3042: Test failed: File not installed
install.c:3043: Test failed: File not installed
install.c:3044: Test failed: Directory not created
install.c:3075: Test failed: Expected ERROR_INSTALL_FAILURE, got 1618
install.c:3091: Test failed: Expected ERROR_INSTALL_FAILURE, got 1618
install.c:3104: Test failed: Expected ERROR_INSTALL_FAILURE, got 1618
install.c:3121: Test failed: Expected ERROR_INSTALL_FAILURE, got 1618
install.c:3165: Test failed: Expected ERROR_SUCCESS, got 1618
install.c:3166: Test failed: File not installed
install.c:3167: Test failed: File not installed
install.c:3168: Test failed: File not installed
install.c:3169: Test failed: Directory not created
install.c:3196: Test failed: Expected ERROR_SUCCESS, got 1618
install.c:3226: Test failed: Expected ERROR_SUCCESS, got 1618
install.c:3291: Test failed: Expected ERROR_SUCCESS, got 1618
install.c:3292: Test failed: Expected file to be overwritten
install.c:3293: Test failed: File not installed
install.c:3294: Test failed: Directory not created
install.c:3343: Test failed: Expected ERROR_SUCCESS, got 1618
install.c:3352: Test failed: Expected file to be overwritten, got ''
install.c:3353: Test failed: File not installed
install.c:3354: Test failed: Directory not created
install.c:3386: Test failed: Expected ERROR_SUCCESS, got 1618
install.c:3387: Test failed: File not installed
install.c:3388: Test failed: Directory not created
install.c:3427: Test failed: Expected ERROR_SUCCESS, got 1618
install.c:3428: Test failed: File not installed
install.c:3429: Test failed: File not installed
install.c:3430: Test failed: File not installed
install.c:3431: Test failed: File not installed
install.c:3432: Test failed: Directory not created
install.c:3663: Test failed: Expected ERROR_SUCCESS, got 1618
install.c:3673: Test failed: Expected ERROR_SUCCESS, got 1618
install.c:3674: Test failed: File not installed
install.c:3675: Test failed: Directory not created
install.c:3712: Test failed: Expected ERROR_FILE_NOT_FOUND, got 1618
install.c:3724: Test failed: Expected ERROR_SUCCESS, got 1618
install.c:3725: Test failed: File not installed
install.c:3726: Test failed: Directory not created
install.c:3740: Test failed: Expected ERROR_SUCCESS, got 1618
install.c:3741: Test failed: File not installed
install.c:3742: Test failed: Directory not created
install.c:3796: Test failed: Expected ERROR_SUCCESS, got 1618
install.c:3804: Test failed: Expected ERROR_SUCCESS, got 1618
install.c:3809: Test failed: File not installed
install.c:3810: Test failed: File not installed
install.c:3875: Test failed: Expected ERROR_SUCCESS, got 1618
install.c:3876: Test failed: File installed
install.c:3877: Test failed: Directory created
install.c:3933: Test failed: Expected ERROR_SUCCESS, got 1618
install.c:3934: Test failed: File not installed
install.c:3935: Test failed: File not installed
install.c:3940: Test failed: Directory not created
install.c:3948: Test failed: Expected ERROR_INSTALL_FAILURE, got 1618
install.c:3958: Test failed: Directory not created
install.c:3994: Test failed: Expected ERROR_INSTALL_FAILURE, got 1618
install.c:4004: Test failed: Expected ERROR_INSTALL_FAILURE, got 1618
install.c:4040: Test failed: Expected ERROR_SUCCESS, got 1618
install.c:4041: Test failed: File installed
install.c:4042: Test failed: Directory created
install.c:4084: Test failed: Expected ERROR_SUCCESS, got 1618
install.c:4085: Test failed: File not installed
install.c:4087: Test failed: File not installed
install.c:4088: Test failed: File not installed
install.c:4097: Test failed: Directory not created
install.c:4100: Test failed: Expected ERROR_SUCCESS, got 1618
install.c:4101: Test failed: File not installed
install.c:4103: Test failed: File not installed
install.c:4104: Test failed: File not installed
install.c:4106: Test failed: File not installed
install.c:4107: Test failed: File not installed
install.c:4109: Test failed: File not installed
install.c:4113: Test failed: Directory not created
install.c:4116: Test failed: Expected ERROR_SUCCESS, got 1618
install.c:4117: Test failed: File not installed
install.c:4120: Test failed: File not installed
install.c:4123: Test failed: File not installed
install.c:4129: Test failed: Directory not created
install.c:4132: Test failed: Expected ERROR_SUCCESS, got 1618
install.c:4567: Test failed: Expected ERROR_SUCCESS, got 1618
install.c:4568: Test failed: File not installed
install.c:4569: Test failed: File not installed
install.c:4570: Test failed: File not installed
install.c:4575: Test failed: Expected ERROR_SUCCESS, got 1618
install.c:4615: Test failed: Expected ERROR_SUCCESS, got 1618
install.c:4616: Test failed: File installed
install.c:4617: Test failed: Directory created
install.c:4629: Test failed: Expected ERROR_SUCCESS, got 1618
install.c:4630: Test failed: File installed
install.c:4631: Test failed: Directory created
install.c:4679: Test failed: Expected ERROR_SUCCESS, got 1618
install.c:2445: Test failed: File not installed
install.c:2446: Test failed: Directory not created
install.c:2447: Test failed: File not installed
install.c:2448: Test failed: Directory not created
install.c:2449: Test failed: File not installed
install.c:2450: Test failed: Directory not created
install.c:2451: Test failed: File not installed
install.c:2452: Test failed: Directory not created
install.c:2453: Test failed: File not installed
install.c:2454: Test failed: File not installed
install.c:2455: Test failed: File not installed
install.c:2456: Test failed: Directory not created
install.c:4722: Test failed: Expected ERROR_SUCCESS, got 1618
install.c:4723: Test failed: File not installed
install.c:4724: Test failed: Directory not created
install.c:4727: Test failed: Expected ERROR_SUCCESS, got 1618
install.c:4728: Test failed: File not installed
install.c:4729: Test failed: Directory not created
install.c:4732: Test failed: Expected ERROR_SUCCESS, got 1618
install.c:4733: Test failed: File not installed
install.c:4734: Test failed: Directory not created
install.c:4831: Test failed: Expected ERROR_SUCCESS, got 1618
install.c:4837: Test failed: Expected ERROR_SUCCESS, got 1618
install.c:4845: Test failed: Expected ERROR_SUCCESS, got 1618
install.c:2445: Test failed: File not installed
install.c:2446: Test failed: Directory not created
install.c:2447: Test failed: File not installed
install.c:2448: Test failed: Directory not created
install.c:2449: Test failed: File not installed
install.c:2450: Test failed: Directory not created
install.c:2451: Test failed: File not installed
install.c:2452: Test failed: Directory not created
install.c:2453: Test failed: File not installed
install.c:2454: Test failed: File not installed
install.c:2455: Test failed: File not installed
install.c:2456: Test failed: Directory not created
install.c:4878: Test failed: Expected ERROR_SUCCESS, got 1618
install.c:4889: Test failed: File not installed
install.c:4891: Test failed: Directory not created
install.c:4894: Test failed: Expected ERROR_SUCCESS, got 1618
install.c:4896: Test failed: File not installed
install.c:4897: Test failed: Directory not created
install.c:4898: Test failed: File not installed
install.c:4899: Test failed: Directory not created
install.c:4900: Test failed: File not installed
install.c:4901: Test failed: Directory not created
install.c:4902: Test failed: File not installed
install.c:4903: Test failed: Directory not created
install.c:4904: Test failed: File not installed
install.c:4906: Test failed: File not installed
install.c:4907: Test failed: Directory not created
install.c:4936: Test failed: Expected ERROR_SUCCESS, got 1618
install.c:4939: Test failed: Expected ERROR_INSTALL_FAILURE, got 1618
install.c:4942: Test failed: Expected ERROR_INSTALL_FAILURE, got 1618
install.c:2445: Test failed: File not installed
install.c:2446: Test failed: Directory not created
install.c:2447: Test failed: File not installed
install.c:2448: Test failed: Directory not created
install.c:2449: Test failed: File not installed
install.c:2450: Test failed: Directory not created
install.c:2451: Test failed: File not installed
install.c:2452: Test failed: Directory not created
install.c:2453: Test failed: File not installed
install.c:2454: Test failed: File not installed
install.c:2455: Test failed: File not installed
install.c:2456: Test failed: Directory not created
install.c:4947: Test failed: Expected ERROR_SUCCESS, got 1618
install.c:5146: Test failed: Expected ERROR_SUCCESS_REBOOT_REQUIRED got 1618
install.c:5083: Test failed: Expected a 'msitest' entry
install.c:5101: Test failed: Expected file to match
install.c:5155: Test failed: File not present
install.c:5156: Test failed: Directory not present or not empty
install.c:5159: Test failed: Expected ERROR_SUCCESS, got 1618
install.c:5208: Test failed: Expected ERROR_SUCCESS_REBOOT_REQUIRED got 1618
install.c:5083: Test failed: Expected a 'msitest' entry
install.c:5101: Test failed: Expected file to match
install.c:5217: Test failed: File not present
install.c:5218: Test failed: Directory not present or not empty
install.c:5221: Test failed: Expected ERROR_SUCCESS, got 1618
install.c:4976: Test failed: Expected ERROR_SUCCESS, got 1618
install.c:2445: Test failed: File not installed
install.c:2446: Test failed: Directory not created
install.c:2447: Test failed: File not installed
install.c:2448: Test failed: Directory not created
install.c:2449: Test failed: File not installed
install.c:2450: Test failed: Directory not created
install.c:2451: Test failed: File not installed
install.c:2452: Test failed: Directory not created
install.c:2453: Test failed: File not installed
install.c:2454: Test failed: File not installed
install.c:2455: Test failed: File not installed
install.c:2456: Test failed: Directory not created
install.c:4981: Test failed: Expected ERROR_SUCCESS, got 1618
install.c:4990: Test failed: Expected ERROR_SUCCESS, got 1618
install.c:2445: Test failed: File not installed
install.c:2446: Test failed: Directory not created
install.c:2447: Test failed: File not installed
install.c:2448: Test failed: Directory not created
install.c:2449: Test failed: File not installed
install.c:2450: Test failed: Directory not created
install.c:2451: Test failed: File not installed
install.c:2452: Test failed: Directory not created
install.c:2453: Test failed: File not installed
install.c:2454: Test failed: File not installed
install.c:2455: Test failed: File not installed
install.c:2456: Test failed: Directory not created
install.c:4995: Test failed: Expected ERROR_SUCCESS, got 1618
install.c:5004: Test failed: Expected ERROR_SUCCESS, got 1618
install.c:2445: Test failed: File not installed
install.c:2446: Test failed: Directory not created
install.c:2447: Test failed: File not installed
install.c:2448: Test failed: Directory not created
install.c:2449: Test failed: File not installed
install.c:2450: Test failed: Directory not created
install.c:2451: Test failed: File not installed
install.c:2452: Test failed: Directory not created
install.c:2453: Test failed: File not installed
install.c:2454: Test failed: File not installed
install.c:2455: Test failed: File not installed
install.c:2456: Test failed: Directory not created
install.c:5009: Test failed: Expected ERROR_SUCCESS, got 1618
install.c:5018: Test failed: Expected ERROR_INSTALL_FAILURE, got 1618
install.c:5262: Test failed: Expected ERROR_SUCCESS, got 1618
install.c:5264: Test failed: file not installed
install.c:5269: Test failed: Expected ERROR_SUCCESS, got 1618
install.c:5274: Test failed: Expected ERROR_SUCCESS, got 1618
install.c:5276: Test failed: file not installed
install.c:5277: Test failed: file not installed
install.c:5281: Test failed: Expected ERROR_SUCCESS, got 1618
install.c:5285: Test failed: file removed
install.c:5286: Test failed: directory removed
install.c:5290: Test failed: Expected ERROR_SUCCESS, got 1618
install.c:5292: Test failed: file not installed
install.c:5293: Test failed: file not installed
install.c:5297: Test failed: Expected ERROR_SUCCESS, got 1618
install.c:5301: Test failed: file removed
install.c:5302: Test failed: directory removed
install.c:5365: Test failed: Failed to do per-user install: 1618
install.c:5372: Test failed: Per-user icon file isn't where it's expected (C:\Users\winetest\AppData\Roaming\Microsoft\Installer\{7DF88A49-996F-4EC8-A022-BF956F9B2CBB}\testicon)
install.c:5375: Test failed: Failed to uninstall per-user
install.c:5380: Test failed: Failed to system-wide install: 1618
install.c:5387: Test failed: System-wide icon file isn't where it's expected (C:\WINDOWS\Installer\{7DF88A49-996F-4EC8-A022-BF956F9B2CBB}\testicon)
install.c:5390: Test failed: Failed to uninstall system-wide
install.c:5419: Test failed: Expected ERROR_SUCCESS, got 1618
install.c:5420: Test failed: file does not exist
install.c:5421: Test failed: directory does not exist
install.c:5427: Test failed: Expected ERROR_INSTALL_LANGUAGE_UNSUPPORTED, got 1618
install.c:5433: Test failed: Expected ERROR_INSTALL_LANGUAGE_UNSUPPORTED, got 1618
install.c:5439: Test failed: Expected ERROR_SUCCESS, got 1618
install.c:5440: Test failed: file does not exist
install.c:5441: Test failed: directory does not exist
install.c:5447: Test failed: Expected ERROR_INSTALL_PLATFORM_UNSUPPORTED, got 1618
install.c:5453: Test failed: Expected ERROR_INSTALL_PLATFORM_UNSUPPORTED, got 1618
install.c:5459: Test failed: Expected ERROR_INSTALL_PLATFORM_UNSUPPORTED, got 1618
install.c:5465: Test failed: Expected ERROR_INSTALL_LANGUAGE_UNSUPPORTED, got 1618
install.c:5474: Test failed: Expected ERROR_SUCCESS, got 1618
install.c:5475: Test failed: file does not exist
install.c:5476: Test failed: directory does not exist
install.c:5481: Test failed: Expected ERROR_SUCCESS, got 1618
install.c:5482: Test failed: file does not exist
install.c:5483: Test failed: directory does not exist
install.c:5490: Test failed: Expected ERROR_INSTALL_PLATFORM_UNSUPPORTED, got 1618
install.c:5500: Test failed: Expected ERROR_SUCCESS, got 1618
install.c:5501: Test failed: file does not exist
install.c:5502: Test failed: directory does not exist
install.c:5508: Test failed: Expected ERROR_INSTALL_PACKAGE_INVALID, got 1618
install.c:5516: Test failed: Expected ERROR_SUCCESS, got 1618
install.c:5517: Test failed: file does not exist
install.c:5518: Test failed: directory does not exist
install.c:5605: Test failed: Expected ERROR_SUCCESS, got 1618
install.c:5607: Test failed: file not installed
install.c:5610: Test failed: Expected ERROR_SUCCESS, got 1618
install.c:5647: Test failed: Expected ERROR_SUCCESS, got 1618
install.c:5652: Test failed: expected RegQueryValueEx to succeed, got 2
install.c:5658: Test failed: can't open 64-bit component key, got 2
install.c:5662: Test failed: expected RegQueryValueEx to succeed, got 6
install.c:5668: Test failed: can't open 32-bit CLSID key, got 2
install.c:5679: Test failed: can't open 64-bit CLSID key, got 2
install.c:5688: Test failed: Expected ERROR_SUCCESS, got 1618
install.c:5710: Test failed: Expected ERROR_SUCCESS, got 1618
install.c:5715: Test failed: expected RegQueryValueEx to succeed, got 2
install.c:5721: Test failed: can't open 64-bit component key, got 2
install.c:5725: Test failed: expected RegQueryValueEx to succeed, got 6
install.c:5731: Test failed: can't open 32-bit CLSID key, got 2
install.c:5742: Test failed: can't open 64-bit CLSID key, got 2
install.c:5751: Test failed: Expected ERROR_SUCCESS, got 1618
install.c:5789: Test failed: got 1618
install.c:5792: Test failed: got 1618
install.c:5818: Test failed: got 1618
install.c:5820: Test failed: file not installed
install.c:5823: Test failed: got 1618
install.c:5825: Test failed: file not installed
install.c:5828: Test failed: got 1618
install.c:5830: Test failed: file removed
install.c:5833: Test failed: got 1618
install.c:5865: Test failed: got 1618
install.c:5870: Test failed: got 2
install.c:5876: Test failed: got 6
install.c:5877: Test failed: got 3735928559
install.c:5879: Test failed: wrong data
install.c:5883: Test failed: Expected ERROR_SUCCESS, got 1618
install.c:5910: Test failed: got 1618
install.c:5913: Test failed: got 1618
install.c:5916: Test failed: got 1618
install.c:5938: Test failed: Expected ERROR_SUCCESS, got 1618
msi.c:1315: Test failed: wrong error 1618
msi.c:3789: Test failed: Expected ERROR_SUCCESS, got 1618
msi.c:3792: Test failed: got -1
msi.c:3799: Test failed: got 1605
msi.c:3800: Test failed: empty path
msi.c:3801: Test failed: got 256
msi.c:3807: Test failed: got 1605
msi.c:3808: Test failed: got 0
msi.c:3814: Test failed: got 1605
msi.c:3815: Test failed: got 0
msi.c:3823: Test failed: got 1605
msi.c:3824: Test failed: empty path
msi.c:3825: Test failed: got 256
msi.c:3830: Test failed: got 1605
msi.c:3831: Test failed: got 0
msi.c:3836: Test failed: got 1605
msi.c:3837: Test failed: got 0
msi.c:3840: Test failed: got 1618
msi.c:13944: Test failed: Expected ERROR_UNKNOWN_PRODUCT, got 1618
msi.c:13951: Test failed: Expected ERROR_UNKNOWN_PRODUCT, got 1618
msi.c:13958: Test failed: Expected ERROR_UNKNOWN_PRODUCT, got 1618
msi.c:13968: Test failed: Expected ERROR_SUCCESS, got 1618
msi.c:13969: Test failed: File not installed
msi.c:13970: Test failed: File not installed
msi.c:13971: Test failed: File not installed
msi.c:13972: Test failed: File not installed
msi.c:13978: Test failed: Expected ERROR_SUCCESS, got 1618
msi.c:13988: Test failed: Expected ERROR_UNKNOWN_PRODUCT, got 1618
msi.c:13993: Test failed: Expected ERROR_SUCCESS, got 1618
msi.c:13994: Test failed: File not installed
msi.c:13995: Test failed: File not installed
msi.c:13996: Test failed: File not installed
msi.c:13997: Test failed: File not installed
msi.c:14003: Test failed: Expected ERROR_SUCCESS, got 1618
msi.c:14013: Test failed: Expected ERROR_UNKNOWN_PRODUCT, got 1618
msi.c:14018: Test failed: Expected ERROR_SUCCESS, got 1618
msi.c:14019: Test failed: File not installed
msi.c:14020: Test failed: File not installed
msi.c:14021: Test failed: File not installed
msi.c:14022: Test failed: File not installed
msi.c:14030: Test failed: Expected ERROR_SUCCESS, got 1618
msi.c:14040: Test failed: Expected ERROR_SUCCESS, got 1618
msi.c:14041: Test failed: File not installed
msi.c:14042: Test failed: File not installed
msi.c:14043: Test failed: File not installed
msi.c:14044: Test failed: File not installed
msi.c:14053: Test failed: Expected ERROR_SUCCESS, got 2
msi.c:14059: Test failed: Expected ERROR_SUCCESS, got 6
msi.c:14063: Test failed: Expected ERROR_SUCCESS, got 6
msi.c:14069: Test failed: Expected ERROR_INSTALL_SOURCE_ABSENT, got 1618
msi.c:14071: Test failed: File not installed
msi.c:14072: Test failed: File not installed
msi.c:14073: Test failed: File not installed
msi.c:14074: Test failed: File not installed
msi.c:14083: Test failed: Expected ERROR_SUCCESS, got 1618
msi.c:14092: Test failed: Expected ERROR_SUCCESS, got 1618
msi.c:14093: Test failed: File not installed
msi.c:14094: Test failed: File not installed
msi.c:14095: Test failed: File not installed
msi.c:14096: Test failed: File not installed
msi.c:14103: Test failed: Expected ERROR_SUCCESS, got 2
msi.c:14109: Test failed: Expected ERROR_SUCCESS, got 6
msi.c:14113: Test failed: Expected ERROR_SUCCESS, got 6
msi.c:14119: Test failed: Expected ERROR_SUCCESS, got 2
msi.c:14125: Test failed: Expected ERROR_SUCCESS, got 6
msi.c:14129: Test failed: Expected ERROR_SUCCESS, got 6
msi.c:14135: Test failed: Expected ERROR_INSTALL_SOURCE_ABSENT, got 1618
msi.c:14137: Test failed: File not installed
msi.c:14138: Test failed: File not installed
msi.c:14139: Test failed: File not installed
msi.c:14140: Test failed: File not installed
msi.c:14145: Test failed: Expected ERROR_SUCCESS, got 6
msi.c:14150: Test failed: Expected ERROR_SUCCESS, got 6
msi.c:14156: Test failed: Expected ERROR_SUCCESS, got 1618
msi.c:14472: Test failed: expected ERROR_SUCCESS, got 1618
msi.c:14481: Test failed: expected ERROR_SUCCESS, got 1605
msi.c:14482: Test failed: expected "C:\Users\winetest\AppData\Local\Temp\", got "aaa"
msi.c:14483: Test failed: expected 37, got 260
msi.c:14486: Test failed: expected ERROR_SUCCESS, got 1618
msi.c:14498: Test failed: expected ERROR_SUCCESS, got 1618
msi.c:14507: Test failed: expected ERROR_SUCCESS, got 1605
msi.c:14508: Test failed: expected "C:\Users\winetest\AppData\Local\Temp\", got "aaa"
msi.c:14509: Test failed: expected 37, got 260
msi.c:14512: Test failed: expected ERROR_SUCCESS, got 1618
msi.c:14526: Test failed: expected ERROR_SUCCESS, got 1618
msi.c:14532: Test failed: expected ERROR_SUCCESS, got 1605
msi.c:14533: Test failed: expected "C:\Users\winetest\AppData\Local\Temp\", got "aaa"
msi.c:14534: Test failed: expected 37, got 260
msi.c:14537: Test failed: expected ERROR_SUCCESS, got 1618
msi: Timeout
package.c:3360: Test failed: Expected ERROR_SUCCESS, got 1618
package.c:3014: Test failed: 3394: expected state 4 got 2
package.c:3014: Test failed: 3395: expected state 4 got 2
package.c:3014: Test failed: 3396: expected state 3 got 2
package.c:3014: Test failed: 3397: expected state 3 got 2
package.c:3040: Test failed: 3408: expected state 3 got 2
package.c:3040: Test failed: 3409: expected state 4 got 2
package.c:3040: Test failed: 3410: expected state 3 got 2
package.c:3040: Test failed: 3411: expected state 3 got 2
package.c:3040: Test failed: 3412: expected state 3 got 2
package.c:3040: Test failed: 3413: expected state 4 got 2
package.c:3043: Test failed: 3413: expected action -1 got 4
package.c:3040: Test failed: 3414: expected state 4 got 2
package.c:3043: Test failed: 3414: expected action -1 got 4
package.c:3040: Test failed: 3415: expected state 3 got 2
package.c:3040: Test failed: 3416: expected state 3 got 2
package.c:3436: Test failed: Expected ERROR_SUCCESS, got 1618
package.c:3445: Test failed: Expected ERROR_SUCCESS, got 1618
package.c:3450: Test failed: state = -1
package.c:3014: Test failed: 3473: expected state 4 got 2
package.c:3014: Test failed: 3474: expected state 4 got 2
package.c:3014: Test failed: 3475: expected state 3 got 2
package.c:3014: Test failed: 3476: expected state 3 got 2
package.c:3014: Test failed: 3478: expected state 4 got 2
package.c:3014: Test failed: 3479: expected state 4 got 2
package.c:3014: Test failed: 3480: expected state 4 got 2
package.c:3014: Test failed: 3481: expected state 4 got 2
package.c:3014: Test failed: 3482: expected state 4 got 2
package.c:3014: Test failed: 3483: expected state 4 got 2
package.c:3014: Test failed: 3484: expected state 3 got 2
package.c:3014: Test failed: 3485: expected state 3 got 2
package.c:3040: Test failed: 3487: expected state 3 got 2
package.c:3040: Test failed: 3488: expected state 4 got 2
package.c:3040: Test failed: 3489: expected state 3 got 2
package.c:3040: Test failed: 3490: expected state 3 got 2
package.c:3040: Test failed: 3491: expected state 3 got 2
package.c:3040: Test failed: 3492: expected state 4 got 2
package.c:3040: Test failed: 3493: expected state 3 got 2
package.c:3040: Test failed: 3494: expected state 3 got 2
package.c:3040: Test failed: 3495: expected state 3 got 2
package.c:3040: Test failed: 3497: expected state 3 got 2
package.c:3040: Test failed: 3498: expected state 4 got 2
package.c:3040: Test failed: 3499: expected state 3 got 2
package.c:3040: Test failed: 3500: expected state 3 got 2
package.c:3040: Test failed: 3501: expected state 3 got 2
package.c:3040: Test failed: 3502: expected state 4 got 2
package.c:3040: Test failed: 3503: expected state 3 got 2
package.c:3040: Test failed: 3504: expected state 3 got 2
package.c:3040: Test failed: 3505: expected state 4 got 2
package.c:3043: Test failed: 3505: expected action -1 got 4
package.c:3040: Test failed: 3506: expected state 4 got 2
package.c:3043: Test failed: 3506: expected action -1 got 4
package.c:3040: Test failed: 3507: expected state 4 got 2
package.c:3043: Test failed: 3507: expected action -1 got 4
package.c:3040: Test failed: 3508: expected state 4 got 2
package.c:3040: Test failed: 3509: expected state 3 got 2
package.c:3515: Test failed: Expected ERROR_SUCCESS, got 1618
package.c:3519: Test failed: Expected ERROR_SUCCESS, got 1618
package.c:3524: Test failed: state = -1
package.c:3014: Test failed: 3553: expected state 4 got 2
package.c:3014: Test failed: 3554: expected state 4 got 2
package.c:3014: Test failed: 3555: expected state 3 got 2
package.c:3014: Test failed: 3556: expected state 3 got 2
package.c:3014: Test failed: 3558: expected state 4 got 2
package.c:3014: Test failed: 3559: expected state 4 got 2
package.c:3014: Test failed: 3560: expected state 4 got 2
package.c:3014: Test failed: 3561: expected state 4 got 2
package.c:3014: Test failed: 3562: expected state 4 got 2
package.c:3014: Test failed: 3563: expected state 4 got 2
package.c:3014: Test failed: 3564: expected state 3 got 2
package.c:3014: Test failed: 3565: expected state 3 got 2
package.c:3040: Test failed: 3567: expected state 3 got 2
package.c:3040: Test failed: 3568: expected state 4 got 2
package.c:3043: Test failed: 3568: expected action -1 got 4
package.c:3040: Test failed: 3569: expected state 4 got 2
package.c:3043: Test failed: 3569: expected action -1 got 4
package.c:3040: Test failed: 3570: expected state 3 got 2
package.c:3040: Test failed: 3571: expected state 3 got 2
package.c:3040: Test failed: 3572: expected state 4 got 2
package.c:3043: Test failed: 3572: expected action -1 got 4
package.c:3040: Test failed: 3573: expected state 4 got 2
package.c:3043: Test failed: 3573: expected action -1 got 4
package.c:3040: Test failed: 3574: expected state 3 got 2
package.c:3040: Test failed: 3575: expected state 3 got 2
package.c:3040: Test failed: 3577: expected state 3 got 2
package.c:3040: Test failed: 3578: expected state 4 got 2
package.c:3043: Test failed: 3578: expected action -1 got 4
package.c:3040: Test failed: 3579: expected state 4 got 2
package.c:3043: Test failed: 3579: expected action -1 got 4
package.c:3040: Test failed: 3580: expected state 3 got 2
package.c:3040: Test failed: 3581: expected state 3 got 2
package.c:3040: Test failed: 3582: expected state 4 got 2
package.c:3043: Test failed: 3582: expected action -1 got 4
package.c:3040: Test failed: 3583: expected state 4 got 2
package.c:3043: Test failed: 3583: expected action -1 got 4
package.c:3040: Test failed: 3584: expected state 3 got 2
package.c:3040: Test failed: 3585: expected state 4 got 2
package.c:3043: Test failed: 3585: expected action -1 got 4
package.c:3040: Test failed: 3586: expected state 4 got 2
package.c:3043: Test failed: 3586: expected action -1 got 4
package.c:3040: Test failed: 3587: expected state 4 got 2
package.c:3043: Test failed: 3587: expected action -1 got 4
package.c:3040: Test failed: 3588: expected state 4 got 2
package.c:3040: Test failed: 3589: expected state 3 got 2
package.c:3043: Test failed: 3589: expected action 3 got -1
package.c:3596: Test failed: Expected ERROR_SUCCESS, got 1618
package.c:3601: Test failed: state = -1
package.c:3014: Test failed: 3630: expected state 4 got 2
package.c:3014: Test failed: 3631: expected state 4 got 2
package.c:3014: Test failed: 3632: expected state 3 got 2
package.c:3014: Test failed: 3633: expected state 3 got 2
package.c:3014: Test failed: 3635: expected state 4 got 2
package.c:3014: Test failed: 3636: expected state 4 got 2
package.c:3014: Test failed: 3637: expected state 4 got 2
package.c:3014: Test failed: 3638: expected state 4 got 2
package.c:3014: Test failed: 3639: expected state 4 got 2
package.c:3014: Test failed: 3640: expected state 4 got 2
package.c:3014: Test failed: 3641: expected state 3 got 2
package.c:3014: Test failed: 3642: expected state 3 got 2
package.c:3040: Test failed: 3644: expected state 3 got 2
package.c:3040: Test failed: 3645: expected state 4 got 2
package.c:3043: Test failed: 3645: expected action -1 got 4
package.c:3040: Test failed: 3646: expected state 4 got 2
package.c:3043: Test failed: 3646: expected action -1 got 4
package.c:3040: Test failed: 3647: expected state 3 got 2
package.c:3040: Test failed: 3648: expected state 3 got 2
package.c:3040: Test failed: 3649: expected state 4 got 2
package.c:3043: Test failed: 3649: expected action -1 got 4
package.c:3040: Test failed: 3650: expected state 4 got 2
package.c:3043: Test failed: 3650: expected action -1 got 4
package.c:3040: Test failed: 3651: expected state 3 got 2
package.c:3040: Test failed: 3652: expected state 3 got 2
package.c:3040: Test failed: 3654: expected state 3 got 2
package.c:3040: Test failed: 3655: expected state 4 got 2
package.c:3043: Test failed: 3655: expected action -1 got 4
package.c:3040: Test failed: 3656: expected state 4 got 2
package.c:3043: Test failed: 3656: expected action -1 got 4
package.c:3040: Test failed: 3657: expected state 3 got 2
package.c:3040: Test failed: 3658: expected state 3 got 2
package.c:3040: Test failed: 3659: expected state 4 got 2
package.c:3043: Test failed: 3659: expected action -1 got 4
package.c:3040: Test failed: 3660: expected state 4 got 2
package.c:3043: Test failed: 3660: expected action -1 got 4
package.c:3040: Test failed: 3661: expected state 3 got 2
package.c:3040: Test failed: 3662: expected state 4 got 2
package.c:3043: Test failed: 3662: expected action -1 got 4
package.c:3040: Test failed: 3663: expected state 4 got 2
package.c:3043: Test failed: 3663: expected action -1 got 4
package.c:3040: Test failed: 3664: expected state 4 got 2
package.c:3043: Test failed: 3664: expected action -1 got 4
package.c:3040: Test failed: 3665: expected state 4 got 2
package.c:3040: Test failed: 3666: expected state 3 got 2
package.c:3043: Test failed: 3666: expected action 3 got -1
package.c:3672: Test failed: Expected ERROR_SUCCESS, got 1618
package.c:3679: Test failed: Expected ERROR_SUCCESS, got 1618
package.c:3681: Test failed: state = -1
package.c:3683: Test failed: state = -1
package.c:3689: Test failed: Expected ERROR_SUCCESS, got 1605
package.c:3691: Test failed: failed to open database: 110
package.c:683: Test failed: Failed to create CustomAction table: 6
package.c:3694: Test failed: failed to insert into CustomAction table: 6
package.c:3695: Test failed: failed to insert into CustomAction table: 6
package.c:3696: Test failed: failed to insert into CustomAction table: 6
package.c:3697: Test failed: failed to insert into CustomAction table: 6
package.c:3698: Test failed: failed to insert into CustomAction table: 6
package.c:3699: Test failed: failed to insert into CustomAction table: 6
package.c:3700: Test failed: failed to insert into CustomAction table: 6
package.c:3701: Test failed: failed to insert into CustomAction table: 6
package.c:3703: Test failed: failed to insert into InstallExecuteSequence table: 6
package.c:3704: Test failed: failed to insert into InstallExecuteSequence table: 6
package.c:3705: Test failed: failed to insert into InstallExecuteSequence table: 6
package.c:3706: Test failed: failed to insert into InstallExecuteSequence table: 6
package.c:3707: Test failed: failed to insert into InstallExecuteSequence table: 6
package.c:3708: Test failed: failed to insert into InstallExecuteSequence table: 6
package.c:3710: Test failed: failed to insert into InstallExecuteSequence table: 6
package.c:3711: Test failed: failed to insert into InstallExecuteSequence table: 6
package.c:3713: Test failed: MsiDatabaseCommit failed: 6
package.c:3715: Test failed: failed to create package 6
package.c:3011: Test failed: 3718: expected 1606 got 6
package.c:3011: Test failed: 3719: expected 1606 got 6
package.c:3721: Test failed: CostInitialize failed
package.c:3011: Test failed: 3722: expected 0 got 6
package.c:3011: Test failed: 3723: expected 0 got 6
package.c:3726: Test failed: FileCost failed
package.c:3011: Test failed: 3727: expected 0 got 6
package.c:3011: Test failed: 3728: expected 0 got 6
package.c:3731: Test failed: CostFinalize failed
package.c:3011: Test failed: 3732: expected 0 got 6
package.c:3011: Test failed: 3733: expected 0 got 6
package.c:3037: Test failed: 3734: expected 0 got 6
package.c:3037: Test failed: 3735: expected 0 got 6
package.c:3037: Test failed: 3736: expected 0 got 6
package.c:3037: Test failed: 3737: expected 0 got 6
package.c:3037: Test failed: 3738: expected 0 got 6
package.c:3037: Test failed: 3739: expected 0 got 6
package.c:3037: Test failed: 3740: expected 0 got 6
package.c:3037: Test failed: 3741: expected 0 got 6
package.c:3037: Test failed: 3742: expected 0 got 6
package.c:3037: Test failed: 3743: expected 0 got 6
package.c:3037: Test failed: 3744: expected 0 got 6
package.c:3037: Test failed: 3745: expected 0 got 6
package.c:3037: Test failed: 3746: expected 0 got 6
package.c:3037: Test failed: 3747: expected 0 got 6
package.c:3037: Test failed: 3748: expected 0 got 6
package.c:3037: Test failed: 3749: expected 0 got 6
package.c:3037: Test failed: 3750: expected 0 got 6
package.c:3037: Test failed: 3751: expected 0 got 6
package.c:3037: Test failed: 3752: expected 0 got 6
package.c:3037: Test failed: 3753: expected 0 got 6
package.c:3037: Test failed: 3754: expected 0 got 6
package.c:3037: Test failed: 3755: expected 0 got 6
package.c:3037: Test failed: 3756: expected 0 got 6
package.c:3759: Test failed: InstallValidate failed 6
package.c:3011: Test failed: 3760: expected 0 got 6
package.c:3011: Test failed: 3761: expected 0 got 6
package.c:3765: Test failed: Expected ERROR_SUCCESS, got 1618
package.c:3768: Test failed: state = -1
package.c:3770: Test failed: state = -1
package.c:3774: Test failed: Expected ERROR_SUCCESS, got 1618
package.c:9640: Test failed: expected ERROR_SUCCESS, got 1618
package.c:9641: Test failed: INSTALL (no UI): the msg 0x0b000000 was expected, but got msg 0x04000000 instead
package.c:9641: Test failed: INSTALL (no UI): the msg sequence is not complete: expected 0b000000 - actual 00000000
package: Timeout

w1064

comctl32:
tooltips.c:240: Test failed: Failed to get current tool 0.
tooltips.c:247: Test failed: Unexpected hwnd CCCCCCCCCCCCCCCC.
tooltips.c:248: Test failed: Unexpected hinst CCCCCCCCCCCCCCCC.
tooltips.c:249: Test failed: Unexpected uId cccccccc.
tooltips.c:250: Test failed: Unexpected lParam cccccccc.
tooltips.c:240: Test failed: Failed to get current tool 0.
tooltips.c:247: Test failed: Unexpected hwnd CCCCCCCCCCCCCCCC.
tooltips.c:248: Test failed: Unexpected hinst CCCCCCCCCCCCCCCC.
tooltips.c:249: Test failed: Unexpected uId cccccccc.
tooltips.c:250: Test failed: Unexpected lParam cccccccc.
tooltips.c:240: Test failed: Failed to get current tool 0.
tooltips.c:247: Test failed: Unexpected hwnd CCCCCCCCCCCCCCCC.
tooltips.c:248: Test failed: Unexpected hinst CCCCCCCCCCCCCCCC.
tooltips.c:249: Test failed: Unexpected uId cccccccc.
tooltips.c:250: Test failed: Unexpected lParam cccccccc.
tooltips.c:240: Test failed: Failed to get current tool 0.
tooltips.c:247: Test failed: Unexpected hwnd CCCCCCCCCCCCCCCC.
tooltips.c:248: Test failed: Unexpected hinst CCCCCCCCCCCCCCCC.
tooltips.c:249: Test failed: Unexpected uId cccccccc.
tooltips.c:250: Test failed: Unexpected lParam cccccccc.
tooltips.c:240: Test failed: Failed to get current tool 0.
tooltips.c:247: Test failed: Unexpected hwnd CCCCCCCCCCCCCCCC.
tooltips.c:248: Test failed: Unexpected hinst CCCCCCCCCCCCCCCC.
tooltips.c:249: Test failed: Unexpected uId cccccccc.
tooltips.c:250: Test failed: Unexpected lParam cccccccc.
tooltips.c:240: Test failed: Failed to get current tool 0.
tooltips.c:247: Test failed: Unexpected hwnd CCCCCCCCCCCCCCCC.
tooltips.c:248: Test failed: Unexpected hinst CCCCCCCCCCCCCCCC.
tooltips.c:249: Test failed: Unexpected uId cccccccc.
tooltips.c:250: Test failed: Unexpected lParam cccccccc.
d3d9:
device.c:1808: Test failed: The cursor handle is 0000000000010003
device.c:4909: Test failed: Didn't receive MOUSEMOVE 0 (50, 50).
mmdevapi:
capture.c:314: Test failed: expect DISCONTINUITY 0
capture.c:318: Test failed: Position 896 gap 0
qmgr:
job.c:586: Test failed: BITS job timed out
job.c:618: Test failed: got 0x00200017
user32:
broadcast.c:152: Test failed: Returned: 0
broadcast.c:153: Test failed: Asynchronous message sent instead
broadcast.c:174: Test failed: Asynchronous message sent instead
broadcast.c:182: Test failed: Returned: 0
broadcast.c:183: Test failed: Asynchronous message sent instead
broadcast.c:152: Test failed: Returned: 0
broadcast.c:153: Test failed: Asynchronous message sent instead
broadcast.c:174: Test failed: Asynchronous message sent instead
broadcast.c:182: Test failed: Returned: 0
broadcast.c:183: Test failed: Asynchronous message sent instead
broadcast.c:238: Test failed: Returned: 0
broadcast.c:239: Test failed: Asynchronous message sent instead
broadcast.c:257: Test failed: Asynchronous message sent instead
broadcast.c:262: Test failed: Returned: 0
broadcast.c:263: Test failed: Asynchronous message sent instead
broadcast.c:238: Test failed: Returned: 0
broadcast.c:239: Test failed: Asynchronous message sent instead
broadcast.c:257: Test failed: Asynchronous message sent instead
broadcast.c:262: Test failed: Returned: 0
broadcast.c:263: Test failed: Asynchronous message sent instead
broadcast.c:298: Test failed: Returned: 0 error 1314
broadcast.c:299: Test failed: Asynchronous message sent instead
broadcast.c:309: Test failed: Returned: 0 error 3405691582
broadcast.c:310: Test failed: Asynchronous message sent instead
broadcast.c:320: Test failed: Returned: 0 error 1314
broadcast.c:321: Test failed: Asynchronous message sent instead
broadcast.c:332: Test failed: Asynchronous message sent instead
msg.c:14595: Test failed: WM_NCRBUTTONDOWN on caption: 0: the msg sequence is not complete: expected 0215 - actual 0000
msg.c:15417: Test failed: key release only: 0: the msg sequence is not complete: expected 0101 - actual 0000
msg.c:15429: Test failed: key press only: 0: the msg sequence is not complete: expected 0100 - actual 0000
msg.c:15441: Test failed: key press repeat: 0: the msg sequence is not complete: expected 0100 - actual 0000
msg.c:15453: Test failed: key release repeat: 0: the msg sequence is not complete: expected 0101 - actual 0000
msg.c:15473: Test failed: key press after setkeyboardstate: 0: the msg sequence is not complete: expected 0100 - actual 0000
msg.c:15493: Test failed: key release after setkeyboardstate: 0: the msg sequence is not complete: expected 0101 - actual 0000
msg.c:15693: Test failed: window hotkey press LWIN: 1: the msg sequence is not complete: expected 0100 - actual 0000
msg.c:15718: Test failed: window hotkey release: 1: the msg sequence is not complete: expected 0101 - actual 0000
msg.c:15723: Test failed: window hotkey release LWIN: 1: the msg sequence is not complete: expected 0101 - actual 0000
msg.c:15751: Test failed: window hotkey combined: 7: the msg sequence is not complete: expected 0100 - actual 0000
msg.c:15765: Test failed: window hotkey previous: 4: the msg sequence is not complete: expected 0100 - actual 0000
msg.c:15780: Test failed: window hotkey new: 3: the msg sequence is not complete: expected 0101 - actual 0000
msg.c:15804: Test failed: thread hotkey press LWIN: 1: the msg sequence is not complete: expected 0100 - actual 0000
msg.c:15833: Test failed: thread hotkey release: 1: the msg sequence is not complete: expected 0101 - actual 0000
msg.c:15841: Test failed: thread hotkey release LWIN: 1: the msg sequence is not complete: expected 0101 - actual 0000
win.c:3233: Test failed: GetActiveWindow() = 0000000000000000
win.c:3233: Test failed: GetFocus() = 0000000000000000
win.c:9419: Test failed: pos = 00e700d0
win.c:9423: Test failed: pos = 00e700d0
win.c:9427: Test failed: pos = 00e700d0